{"text_format":"1","workbook":"xlsx","n_sheets":14,"sheets":["Instructions","MASTOR CONTROLS","Jan","Feb","Mar","April","May","June","July","Aug","Sept","Oct","Nov","Dec"],"not_rendered":{"charts":0,"images":0,"macros":1,"external_links":0,"defined_names":16,"comments":0,"pivot_tables":0},"unopened":[],"bounds":{"document_bytes":16777216,"sheet_cells":100000,"rows_first":2000,"rows_last":500,"rows_between":2000,"halvings":0,"cell_chars":16384,"cell_head_chars":4096},"cells_cut":0,"cells_raw":0,"read":"whole","date_system":"1900"}

{"sheet":"Instructions","index":0,"n_rows":14,"n_cols":1,"rows_kept":14,"cut":false,"hidden":false,"merged":[]}
["Instructions"]
[]
["Name, Address, Phone, and Email: Enter your Name, Address, Phone number, and email. (Important: If you have a change to your personal information please contact HR at (916) 886-5698 or hr@nccsda.com with your new information.)"]
[]
["Description: All employees must select a description from the drop-down menu for every day including weekends."]
[]
["Comments: If you have any notes or comments, please write them in this box."]
[]
["Requirements: All salaried 12-month educators and salaried ECEC directors must turn in Educator Monthly Reports."]
[]
["Submission: "]
["1. Educator Monthly Reports must be turned in on the due date specified on the upper right side of the report. "]
["2. Please email them to payroll at payroll@nccsda.com (preferred) or faxed to 888-502-9698. Please put \"EMR\" or \"Educator Monthly Report\" in the email subject line. "]
["3. Please submit your Educator Monthly Report using your conference email account. "]

{"sheet":"MASTOR CONTROLS","index":1,"n_rows":16,"n_cols":10,"rows_kept":16,"cut":false,"hidden":true,"merged":[[0,0,0,3],[0,5,0,8],[13,0,22,3]]}
["Per Diem Rates",null,null,null,null,"Date Controls"]
[null,null,null,null,null,null,null,null,{"$f":"IF(G2>1,VLOOKUP(G2,F3:I15,2),\"\")","v":""},{"$f":"IF(G2>1,VLOOKUP(G2,F3:I15,4),\"\")","v":""}]
[1,"Choose From…","TX","Non-TX",null,1,"Select Month"]
[2,"NT - 1 Meal",null,{"$f":"ROUND(D5*0.5,0)","v":0},null,2,"2026-01-01",null,{"$f":"G5-1","v":"2026-01-31"}]
[3,"NT - 2/3 Meals",null,0,null,3,{"$f":"DATE(YEAR(G4),MONTH(G4)+1,1)","v":"2026-02-01"},null,{"$f":"G6-1","v":"2026-02-28"}]
[4,"1 Meal ",{"$f":"ROUND(D4,0)","v":0},null,null,4,"2026-03-01",null,"2026-03-31"]
[5,"2/3 Meals",{"$f":"D5","v":0},null,null,5,"2026-04-01",null,"2026-04-30"]
[6,"U & Spouse 1 Meal",{"$f":"C9*0.5","v":0},null,null,6,"2026-05-01",null,"2026-05-31"]
[7,"U & Spouse 2/3 Meals",0,null,null,7,"2026-06-01",null,"2026-06-30"]
[8,"NT - U & Spouse 1 Meal",{"$f":"ROUND(C8-D10,0)","v":0},{"$f":"ROUND(D4,0)","v":0},null,8,"2026-07-01",null,"2026-07-31"]
[9,"NT - U & Spouse 2/3 Meals",{"$f":"C9-D11","v":0},{"$f":"D5","v":0},null,9,"2026-08-01",null,"2026-08-31"]
[null,null,null,null,null,10,"2026-09-01",null,"2026-09-30"]
[null,null,null,null,null,11,"2026-10-01",null,"2026-10-31"]
["INSTRUCTIONS:  Enter the correct value in the blue cell and the rest of that section will automatically adjust based on the value you have entered. The Date Controls value should be set to the first day of the year (ie \"1/1/2008\" for the year 2008).",null,null,null,null,12,"2026-11-01",null,"2026-11-30"]
[null,null,null,null,null,13,"2026-12-01",null,"2026-12-31"]
[null,null,null,null,null,null,"2027-01-01"]

{"sheet":"Jan","index":2,"n_rows":59,"n_cols":9,"rows_kept":59,"cut":false,"hidden":false,"merged":[[52,0,52,5],[5,1,5,3],[6,1,6,3],[60,2,60,3],[57,0,57,5],[58,0,58,1],[53,0,55,5],[0,0,0,5],[1,0,1,5],[2,0,2,5],[10,0,10,5],[4,1,4,3],[9,1,9,3],[8,1,8,3],[7,0,7,3]]}
[{"$f":"\"Northern California Conference\" & IF($I$57=TRUE,\" (REVISED)\",\"\")","v":"Northern California Conference"}]
[" Monthly Report"]
["Send to:  Email: payroll@nccsda.com      -      P.O. Box 619015 Roseville, CA 95661"]
[]
["Name:",null,null,null,null,"2026-01-01"]
["Address:",null,null,null,null,{"$f":" IF(F5<>'MASTOR CONTROLS'!G3,\"Due \" & TEXT(DATE(1,MONTH(B20)+1,1),\"mmmm\") & \" 3rd.\",\"\")","v":"Due February 3rd."}]
[]
["Best way to contact you:"]
["Phone:"]
["Email: "]
["Please notify HR (916-886-5698) of any change in address or phone #."]
[]
[null,"Date","Description","Vacation Days","Sick Days"]
[]
[null,"Worked"]
[null,"Day Off"]
[null,"Vacation"]
[null,"Sick Day"]
[null,"Holiday"]
[null,{"$f":"IF($F$5<>'MASTOR CONTROLS'!D3,F5,\"\")","v":"2026-01-01"},null,{"$f":"IF(C20=\"Vacation\", 1,0)","v":0},{"$f":"IF(C20=\"Sick Day\", 1,0)","v":0}]
{"$rows_left_out":40}
{"sheet":"Feb","index":3,"n_rows":59,"n_cols":9,"rows_kept":59,"cut":false,"hidden":false,"merged":[[0,0,0,5],[1,0,1,5],[2,0,2,5],[4,1,4,3],[57,0,57,5],[58,0,58,1],[60,2,60,3],[5,1,5,3],[6,1,6,3],[52,0,52,5],[53,0,55,5],[7,0,7,3],[8,1,8,3],[9,1,9,3],[10,0,10,5]]}
[{"$f":"\"Northern California Conference\" & IF($I$57=TRUE,\" (REVISED)\",\"\")","v":"Northern California Conference"}]
["Monthly Report"]
["Send to:  Email: payroll@nccsda.com      -      P.O. Box 619015 Roseville, CA 95661"]
[]
["Name:",{"$f":"+Jan!B5","v":0},null,null,null,"2026-02-01"]
["Address:",{"$f":"+Jan!B6","v":0},null,null,null,{"$f":" IF(F5<>'MASTOR CONTROLS'!G3,\"Due \" & TEXT(DATE(1,MONTH(B20)+1,1),\"mmmm\") & \" 3rd.\",\"\")","v":"Due March 3rd."}]
[null,{"$f":"+Jan!B7","v":0}]
["Best way to contact you:"]
["Phone:",{"$f":"+Jan!B9","v":0}]
["Email: ",{"$f":"+Jan!B10","v":0}]
["Please notify HR (916-886-5698) of any change in address or phone #."]
[]
[null,"Date","Description","Vacation Days","Sick Days"]
[]
[null,"Worked"]
[null,"Day Off"]
[null,"Vacation"]
[null,"Sick Day"]
[null,"Holiday"]
[null,{"$f":"IF(F5<>'MASTOR CONTROLS'!D3,F5,\"\")","v":"2026-02-01"},null,{"$f":"IF(C20=\"Vacation\", 1,0)","v":0},{"$f":"IF(C20=\"Sick Day\", 1,0)","v":0}]
{"$rows_left_out":40}
{"sheet":"Mar","index":4,"n_rows":59,"n_cols":9,"rows_kept":59,"cut":false,"hidden":false,"merged":[[6,1,6,3],[0,0,0,5],[1,0,1,5],[2,0,2,5],[4,1,4,3],[5,1,5,3],[53,0,55,5],[57,0,57,5],[58,0,58,1],[60,2,60,3],[7,0,7,3],[8,1,8,3],[9,1,9,3],[10,0,10,5],[52,0,52,5]]}
[{"$f":"\"Northern California Conference\" & IF($I$57=TRUE,\" (REVISED)\",\"\")","v":"Northern California Conference"}]
["Monthly Report"]
["Send to:  Email: payroll@nccsda.com      -      P.O. Box 619015 Roseville, CA 95661"]
[]
["Name:",{"$f":"+Jan!B5","v":0},null,null,null,"2026-03-01"]
["Address:",{"$f":"+Jan!B6","v":0},null,null,null,{"$f":" IF(F5<>'MASTOR CONTROLS'!G3,\"Due \" & TEXT(DATE(1,MONTH(B20)+1,1),\"mmmm\") & \" 3rd.\",\"\")","v":"Due April 3rd."}]
[null,{"$f":"+Jan!B7","v":0}]
["Best way to contact you:"]
["Phone:",{"$f":"+Jan!B9","v":0}]
["Email: ",{"$f":"+Jan!B10","v":0}]
["Please notify HR (916-886-5698) of any change in address or phone #."]
[]
[null,"Date","Description","Vacation Days","Sick Days"]
[]
[null,"Worked"]
[null,"Day Off"]
[null,"Vacation"]
[null,"Sick Day"]
[null,"Holiday"]
[null,{"$f":"IF(F5<>'MASTOR CONTROLS'!D3,F5,\"\")","v":"2026-03-01"},null,{"$f":"IF(C20=\"Vacation\", 1,0)","v":0},{"$f":"IF(C20=\"Sick Day\", 1,0)","v":0}]
{"$rows_left_out":40}
{"sheet":"April","index":5,"n_rows":59,"n_cols":9,"rows_kept":59,"cut":false,"hidden":false,"merged":[[6,1,6,3],[0,0,0,5],[1,0,1,5],[2,0,2,5],[4,1,4,3],[5,1,5,3],[53,0,55,5],[57,0,57,5],[58,0,58,1],[60,2,60,3],[7,0,7,3],[8,1,8,3],[9,1,9,3],[10,0,10,5],[52,0,52,5]]}
[{"$f":"\"Northern California Conference\" & IF($I$57=TRUE,\" (REVISED)\",\"\")","v":"Northern California Conference"}]
["Monthly Report"]
["Send to:  Email: payroll@nccsda.com      -      P.O. Box 619015 Roseville, CA 95661"]
[]
["Name:",{"$f":"+Jan!B5","v":0},null,null,null,"2026-04-01"]
["Address:",{"$f":"+Jan!B6","v":0},null,null,null,{"$f":" IF(F5<>'MASTOR CONTROLS'!G3,\"Due \" & TEXT(DATE(1,MONTH(B20)+1,1),\"mmmm\") & \" 3rd.\",\"\")","v":"Due May 3rd."}]
[null,{"$f":"+Jan!B7","v":0}]
["Best way to contact you:"]
["Phone:",{"$f":"+Jan!B9","v":0}]
["Email: ",{"$f":"+Jan!B10","v":0}]
["Please notify HR (916-886-5698) of any change in address or phone #."]
[]
[null,"Date","Description","Vacation Days","Sick Days"]
[]
[null,"Worked"]
[null,"Day Off"]
[null,"Vacation"]
[null,"Sick Day"]
[null,"Holiday"]
[null,{"$f":"IF(F5<>'MASTOR CONTROLS'!D3,F5,\"\")","v":"2026-04-01"},null,{"$f":"IF(C20=\"Vacation\", 1,0)","v":0},{"$f":"IF(C20=\"Sick Day\", 1,0)","v":0}]
{"$rows_left_out":40}
{"sheet":"May","index":6,"n_rows":59,"n_cols":9,"rows_kept":59,"cut":false,"hidden":false,"merged":[[6,1,6,3],[0,0,0,5],[1,0,1,5],[2,0,2,5],[4,1,4,3],[5,1,5,3],[53,0,55,5],[57,0,57,5],[58,0,58,1],[60,2,60,3],[7,0,7,3],[8,1,8,3],[9,1,9,3],[10,0,10,5],[52,0,52,5]]}
[{"$f":"\"Northern California Conference\" & IF($I$57=TRUE,\" (REVISED)\",\"\")","v":"Northern California Conference"}]
["Monthly Report"]
["Send to:  Email: payroll@nccsda.com      -      P.O. Box 619015 Roseville, CA 95661"]
[]
["Name:",{"$f":"+Jan!B5","v":0},null,null,null,"2026-05-01"]
["Address:",{"$f":"+Jan!B6","v":0},null,null,null,{"$f":" IF(F5<>'MASTOR CONTROLS'!G3,\"Due \" & TEXT(DATE(1,MONTH(B20)+1,1),\"mmmm\") & \" 3rd.\",\"\")","v":"Due June 3rd."}]
[null,{"$f":"+Jan!B7","v":0}]
["Best way to contact you:"]
["Phone:",{"$f":"+Jan!B9","v":0}]
["Email: ",{"$f":"+Jan!B10","v":0}]
["Please notify HR (916-886-5698) of any change in address or phone #."]
[]
[null,"Date","Description","Vacation Days","Sick Days"]
[]
[null,"Worked"]
[null,"Day Off"]
[null,"Vacation"]
[null,"Sick Day"]
[null,"Holiday"]
[null,{"$f":"IF(F5<>'MASTOR CONTROLS'!D3,F5,\"\")","v":"2026-05-01"},null,{"$f":"IF(C20=\"Vacation\", 1,0)","v":0},{"$f":"IF(C20=\"Sick Day\", 1,0)","v":0}]
{"$rows_left_out":40}
{"sheet":"June","index":7,"n_rows":59,"n_cols":9,"rows_kept":59,"cut":false,"hidden":false,"merged":[[6,1,6,3],[0,0,0,5],[1,0,1,5],[2,0,2,5],[4,1,4,3],[5,1,5,3],[53,0,55,5],[57,0,57,5],[58,0,58,1],[60,2,60,3],[7,0,7,3],[8,1,8,3],[9,1,9,3],[10,0,10,5],[52,0,52,5]]}
[{"$f":"\"Northern California Conference\" & IF($I$57=TRUE,\" (REVISED)\",\"\")","v":"Northern California Conference"}]
["Monthly Report"]
["Send to:  Email: payroll@nccsda.com      -      P.O. Box 619015 Roseville, CA 95661"]
[]
["Name:",{"$f":"+Jan!B5","v":0},null,null,null,"2026-06-01"]
["Address:",{"$f":"+Jan!B6","v":0},null,null,null,{"$f":" IF(F5<>'MASTOR CONTROLS'!G3,\"Due \" & TEXT(DATE(1,MONTH(B20)+1,1),\"mmmm\") & \" 3rd.\",\"\")","v":"Due July 3rd."}]
[null,{"$f":"+Jan!B7","v":0}]
["Best way to contact you:"]
["Phone:",{"$f":"+Jan!B9","v":0}]
["Email: ",{"$f":"+Jan!B10","v":0}]
["Please notify HR (916-886-5698) of any change in address or phone #."]
[]
[null,"Date","Description","Vacation Days","Sick Days"]
[]
[null,"Worked"]
[null,"Day Off"]
[null,"Vacation"]
[null,"Sick Day"]
[null,"Holiday"]
[null,{"$f":"IF(F5<>'MASTOR CONTROLS'!D3,F5,\"\")","v":"2026-06-01"},null,{"$f":"IF(C20=\"Vacation\", 1,0)","v":0},{"$f":"IF(C20=\"Sick Day\", 1,0)","v":0}]
{"$rows_left_out":40}
{"sheet":"July","index":8,"n_rows":59,"n_cols":9,"rows_kept":59,"cut":false,"hidden":false,"merged":[[6,1,6,3],[0,0,0,5],[1,0,1,5],[2,0,2,5],[4,1,4,3],[5,1,5,3],[53,0,55,5],[57,0,57,5],[58,0,58,1],[60,2,60,3],[7,0,7,3],[8,1,8,3],[9,1,9,3],[10,0,10,5],[52,0,52,5]]}
[{"$f":"\"Northern California Conference\" & IF($I$57=TRUE,\" (REVISED)\",\"\")","v":"Northern California Conference"}]
["Monthly Report"]
["Send to:  Email: payroll@nccsda.com      -      P.O. Box 619015 Roseville, CA 95661"]
[]
["Name:",{"$f":"+Jan!B5","v":0},null,null,null,"2026-07-01"]
["Address:",{"$f":"+Jan!B6","v":0},null,null,null,{"$f":" IF(F5<>'MASTOR CONTROLS'!G3,\"Due \" & TEXT(DATE(1,MONTH(B20)+1,1),\"mmmm\") & \" 3rd.\",\"\")","v":"Due August 3rd."}]
[null,{"$f":"+Jan!B7","v":0}]
["Best way to contact you:"]
["Phone:",{"$f":"+Jan!B9","v":0}]
["Email: ",{"$f":"+Jan!B10","v":0}]
["Please notify HR (916-886-5698) of any change in address or phone #."]
[]
[null,"Date","Description","Vacation Days","Sick Days"]
[]
[null,"Worked"]
[null,"Day Off"]
[null,"Vacation"]
[null,"Sick Day"]
[null,"Holiday"]
[null,{"$f":"IF(F5<>'MASTOR CONTROLS'!D3,F5,\"\")","v":"2026-07-01"},null,{"$f":"IF(C20=\"Vacation\", 1,0)","v":0},{"$f":"IF(C20=\"Sick Day\", 1,0)","v":0}]
{"$rows_left_out":40}
{"sheet":"Aug","index":9,"n_rows":59,"n_cols":9,"rows_kept":59,"cut":false,"hidden":false,"merged":[[6,1,6,3],[0,0,0,5],[1,0,1,5],[2,0,2,5],[4,1,4,3],[5,1,5,3],[53,0,55,5],[57,0,57,5],[58,0,58,1],[60,2,60,3],[7,0,7,3],[8,1,8,3],[9,1,9,3],[10,0,10,5],[52,0,52,5]]}
[{"$f":"\"Northern California Conference\" & IF($I$57=TRUE,\" (REVISED)\",\"\")","v":"Northern California Conference"}]
["Monthly Report"]
["Send to:  Email: payroll@nccsda.com      -      P.O. Box 619015 Roseville, CA 95661"]
[]
["Name:",{"$f":"+Jan!B5","v":0},null,null,null,"2026-08-01"]
["Address:",{"$f":"+Jan!B6","v":0},null,null,null,{"$f":" IF(F5<>'MASTOR CONTROLS'!G3,\"Due \" & TEXT(DATE(1,MONTH(B20)+1,1),\"mmmm\") & \" 3rd.\",\"\")","v":"Due September 3rd."}]
[null,{"$f":"+Jan!B7","v":0}]
["Best way to contact you:"]
["Phone:",{"$f":"+Jan!B9","v":0}]
["Email: ",{"$f":"+Jan!B10","v":0}]
["Please notify HR (916-886-5698) of any change in address or phone #."]
[]
[null,"Date","Description","Vacation Days","Sick Days"]
[]
[null,"Worked"]
[null,"Day Off"]
[null,"Vacation"]
[null,"Sick Day"]
[null,"Holiday"]
[null,{"$f":"IF(F5<>'MASTOR CONTROLS'!D3,F5,\"\")","v":"2026-08-01"},null,{"$f":"IF(C20=\"Vacation\", 1,0)","v":0},{"$f":"IF(C20=\"Sick Day\", 1,0)","v":0}]
{"$rows_left_out":40}
{"sheet":"Sept","index":10,"n_rows":59,"n_cols":9,"rows_kept":59,"cut":false,"hidden":false,"merged":[[6,1,6,3],[0,0,0,5],[1,0,1,5],[2,0,2,5],[4,1,4,3],[5,1,5,3],[53,0,55,5],[57,0,57,5],[58,0,58,1],[60,2,60,3],[7,0,7,3],[8,1,8,3],[9,1,9,3],[10,0,10,5],[52,0,52,5]]}
[{"$f":"\"Northern California Conference\" & IF($I$57=TRUE,\" (REVISED)\",\"\")","v":"Northern California Conference"}]
["Monthly Report"]
["Send to:  Email: payroll@nccsda.com      -      P.O. Box 619015 Roseville, CA 95661"]
[]
["Name:",{"$f":"+Jan!B5","v":0},null,null,null,"2026-09-01"]
["Address:",{"$f":"+Jan!B6","v":0},null,null,null,{"$f":" IF(F5<>'MASTOR CONTROLS'!G3,\"Due \" & TEXT(DATE(1,MONTH(B20)+1,1),\"mmmm\") & \" 3rd.\",\"\")","v":"Due October 3rd."}]
[null,{"$f":"+Jan!B7","v":0}]
["Best way to contact you:"]
["Phone:",{"$f":"+Jan!B9","v":0}]
["Email: ",{"$f":"+Jan!B10","v":0}]
["Please notify HR (916-886-5698) of any change in address or phone #."]
[]
[null,"Date","Description","Vacation Days","Sick Days"]
[]
[null,"Worked"]
[null,"Day Off"]
[null,"Vacation"]
[null,"Sick Day"]
[null,"Holiday"]
[null,{"$f":"IF(F5<>'MASTOR CONTROLS'!D3,F5,\"\")","v":"2026-09-01"},null,{"$f":"IF(C20=\"Vacation\", 1,0)","v":0},{"$f":"IF(C20=\"Sick Day\", 1,0)","v":0}]
{"$rows_left_out":40}
{"sheet":"Oct","index":11,"n_rows":59,"n_cols":9,"rows_kept":59,"cut":false,"hidden":false,"merged":[[6,1,6,3],[0,0,0,5],[1,0,1,5],[2,0,2,5],[4,1,4,3],[5,1,5,3],[53,0,55,5],[57,0,57,5],[58,0,58,1],[60,2,60,3],[7,0,7,3],[8,1,8,3],[9,1,9,3],[10,0,10,5],[52,0,52,5]]}
[{"$f":"\"Northern California Conference\" & IF($I$57=TRUE,\" (REVISED)\",\"\")","v":"Northern California Conference"}]
["Monthly Report"]
["Send to:  Email: payroll@nccsda.com     -      P.O. Box 619015 Roseville, CA 95661"]
[]
["Name:",{"$f":"+Jan!B5","v":0},null,null,null,"2026-10-01"]
["Address:",{"$f":"+Jan!B6","v":0},null,null,null,{"$f":" IF(F5<>'MASTOR CONTROLS'!G3,\"Due \" & TEXT(DATE(1,MONTH(B20)+1,1),\"mmmm\") & \" 3rd.\",\"\")","v":"Due November 3rd."}]
[null,{"$f":"+Jan!B7","v":0}]
["Best way to contact you:"]
["Phone:",{"$f":"+Jan!B9","v":0}]
["Email: ",{"$f":"+Jan!B10","v":0}]
["Please notify HR (916-886-5698) of any change in address or phone #."]
[]
[null,"Date","Description","Vacation Days","Sick Days"]
[]
[null,"Worked"]
[null,"Day Off"]
[null,"Vacation"]
[null,"Sick Day"]
[null,"Holiday"]
[null,{"$f":"IF(F5<>'MASTOR CONTROLS'!D3,F5,\"\")","v":"2026-10-01"},null,{"$f":"IF(C20=\"Vacation\", 1,0)","v":0},{"$f":"IF(C20=\"Sick Day\", 1,0)","v":0}]
{"$rows_left_out":40}
{"sheet":"Nov","index":12,"n_rows":59,"n_cols":9,"rows_kept":59,"cut":false,"hidden":false,"merged":[[6,1,6,3],[0,0,0,5],[1,0,1,5],[2,0,2,5],[4,1,4,3],[5,1,5,3],[53,0,55,5],[57,0,57,5],[58,0,58,1],[60,2,60,3],[7,0,7,3],[8,1,8,3],[9,1,9,3],[10,0,10,5],[52,0,52,5]]}
[{"$f":"\"Northern California Conference\" & IF($I$57=TRUE,\" (REVISED)\",\"\")","v":"Northern California Conference"}]
["Monthly Report"]
["Send to:  Email: payroll@nccsda.com      -      P.O. Box 619015 Roseville, CA 95661"]
[]
["Name:",{"$f":"+Jan!B5","v":0},null,null,null,"2026-11-01"]
["Address:",{"$f":"+Jan!B6","v":0},null,null,null,{"$f":" IF(F5<>'MASTOR CONTROLS'!G3,\"Due \" & TEXT(DATE(1,MONTH(B20)+1,1),\"mmmm\") & \" 3rd.\",\"\")","v":"Due December 3rd."}]
[null,{"$f":"+Jan!B7","v":0}]
["Best way to contact you:"]
["Phone:",{"$f":"+Jan!B9","v":0}]
["Email: ",{"$f":"+Jan!B10","v":0}]
["Please notify HR (916-886-5698) of any change in address or phone #."]
[]
[null,"Date","Description","Vacation Days","Sick Days"]
[]
[null,"Worked"]
[null,"Day Off"]
[null,"Vacation"]
[null,"Sick Day"]
[null,"Holiday"]
[null,{"$f":"IF(F5<>'MASTOR CONTROLS'!D3,F5,\"\")","v":"2026-11-01"},null,{"$f":"IF(C20=\"Vacation\", 1,0)","v":0},{"$f":"IF(C20=\"Sick Day\", 1,0)","v":0}]
{"$rows_left_out":40}
{"sheet":"Dec","index":13,"n_rows":59,"n_cols":9,"rows_kept":59,"cut":false,"hidden":false,"merged":[[6,1,6,3],[0,0,0,5],[1,0,1,5],[2,0,2,5],[4,1,4,3],[5,1,5,3],[53,0,55,5],[57,0,57,5],[58,0,58,1],[60,2,60,3],[7,0,7,3],[8,1,8,3],[9,1,9,3],[10,0,10,5],[52,0,52,5]]}
[{"$f":"\"Northern California Conference\" & IF($I$57=TRUE,\" (REVISED)\",\"\")","v":"Northern California Conference"}]
["Monthly Report"]
["Send to:  Email: payroll@nccsda.com      -     P.O. Box 619015 Roseville, CA 95661"]
[]
["Name:",{"$f":"+Jan!B5","v":0},null,null,null,"2026-12-01"]
["Address:",{"$f":"+Jan!B6","v":0},null,null,null,{"$f":" IF(F5<>'MASTOR CONTROLS'!G3,\"Due \" & TEXT(DATE(1,MONTH(B20)+1,1),\"mmmm\") & \" 3rd.\",\"\")","v":"Due January 3rd."}]
[null,{"$f":"+Jan!B7","v":0}]
["Best way to contact you:"]
["Phone:",{"$f":"+Jan!B9","v":0}]
["Email: ",{"$f":"+Jan!B10","v":0}]
["Please notify HR (916-886-5698) of any change in address or phone #."]
[]
[null,"Date","Description","Vacation Days","Sick Days"]
[]
[null,"Worked"]
[null,"Day Off"]
[null,"Vacation"]
[null,"Sick Day"]
[null,"Holiday"]
[null,{"$f":"IF(F5<>'MASTOR CONTROLS'!D3,F5,\"\")","v":"2026-12-01"},null,{"$f":"IF(C20=\"Vacation\", 1,0)","v":0},{"$f":"IF(C20=\"Sick Day\", 1,0)","v":0}]
{"$rows_left_out":39}