{"text_format":"1","workbook":"xlsx","n_sheets":15,"sheets":["Instructions","Jan","Feb","Mar","Apr","May","Jun","Jul","Aug","Sep","Oct","Nov","Dec","Policy","MASTER CONTROLS"],"not_rendered":{"charts":0,"images":0,"macros":0,"external_links":0,"defined_names":37,"comments":0,"pivot_tables":0},"unopened":[],"bounds":{"document_bytes":16777216,"sheet_cells":100000,"rows_first":2000,"rows_last":500,"rows_between":2000,"halvings":0,"cell_chars":16384,"cell_head_chars":4096},"cells_cut":0,"cells_raw":0,"read":"whole","date_system":"1900"}

{"sheet":"Instructions","index":0,"n_rows":15,"n_cols":1,"rows_kept":15,"cut":false,"hidden":false,"merged":[]}
["Instructions"]
[]
["Name, Address, Phone, and Email: Enter your Name, Address, Phone number, and email. If you have a change to your personal information please log in to APS Employee online and update it there. If we receive your report without a name, we cannot process it."]
[]
["Short Description: All employees must select a description for each and every day, even days that were not worked. We use this column to update your vacation/sick balance. Select \"Worked\" on days that you worked. Select \"Day Off\" on days that you did not work and would not usually work (for example, an office employee who typically works Monday through Thursday would select \"Day Off\" for most Fridays, Sabbaths, or Sundays). Select \"Holiday\" if you did not work on a holiday that the conference considers a paid holiday (this list of holidays can be found on the payroll schedule at nccsda.com). Select \"Sick\" to use your sick leave, and select \"Vacation\" when you use your vacation leave. You can contact Lydia at lydia.paredes@nccsda.com to check your vacation balance."]
[]
["Daily Activity Description: When reporting mileage, please enter a summary description of the type of work you did and the location. Examples would be \"Roseville visitation\" or \"Oakland funeral\". Do your best to be brief, since longer descriptions may not print correctly.  Do not include mileage for activities at your home church (e.g. Sabbath services)."]
[]
["Per Diem: The note to the right of the lodging column describes what is non taxable (NT) and what isn't.  Select from the list provided and it will fill in the correct rates in the per diem columns. Per diem is taxable when your special activity/event does not include an overnight stay."]
[]
["Pastor's Section: All churches are required to submit the information requested in the Pastor's Section. "]
[]
["Comments: If you have any notes or comments that don't fit anywhere else just put them in this box. Please do not use abbreviations in your descriptions. We often do not know what your abbreviations mean, and this may delay processing your report. "]
[]
["Due Dates: Reports are due on the 3rd day of each month to be processed on the first payroll of the month. Late reports will be processed on the first payroll of the following month. For example, January reports are due on February 3rd, and will be paid on February 10; if we receive a January report too late to include it on the February 10 payroll, it will be added to the March 10 payroll."]

{"sheet":"Jan","index":1,"n_rows":70,"n_cols":22,"rows_kept":70,"cut":false,"hidden":false,"merged":[[71,27,71,28],[72,27,72,28],[73,27,73,28],[67,0,67,2],[69,0,69,1],[69,6,69,7],[69,12,69,13],[77,18,77,19],[58,24,58,26],[59,24,59,26],[60,24,60,25],[61,24,61,26],[67,3,67,4],[58,29,58,31],[59,29,59,31],[60,29,60,31],[61,29,61,31],[70,27,70,28],[38,6,38,7],[37,6,37,7],[36,6,36,7],[35,6,35,7],[68,14,68,15],[65,14,65,15],[66,14,66,15],[67,14,67,15],[64,0,64,15],[67,12,67,13],[66,12,66,13],[65,12,65,13],[68,12,68,13],[68,3,68,4],[65,3,65,4],[66,6,66,8],[65,0,65,2],[66,0,66,2],[66,3,66,4],[34,6,34,7],[47,6,47,7],[46,6,46,7],[45,6,45,7],[44,6,44,7],[42,6,42,7],[43,6,43,7],[41,6,41,7],[40,6,40,7],[39,6,39,7],[19,6,19,7],[18,6,18,7],[17,6,17,7],[10,6,10,7],[33,6,33,7],[32,6,32,7],[31,6,31,7],[30,6,30,7],[29,6,29,7],[28,6,28,7],[27,6,27,7],[26,6,26,7],[25,6,25,7],[3,16,3,19],[4,16,6,19],[7,16,7,19],[6,0,6,9],[7,1,7,3],[9,11,9,12],[9,8,10,9],[17,8,17,9],[18,1,18,5],[18,8,18,9],[47,8,47,9],[43,1,43,5],[60,2,61,15],[59,11,59,12],[56,0,56,6],[59,6,59,8],[57,0,57,6],[53,8,54,9],[56,8,56,9],[55,0,55,6],[51,0,51,12],[50,0,50,2],[53,11,53,15],[59,13,59,14],[59,9,59,10],[55,8,55,9],[48,6,48,7],[0,0,0,15],[37,1,37,5],[38,1,38,5],[9,1,9,5],[10,1,10,5],[17,1,17,5],[9,14,10,15],[9,6,9,7],[36,1,36,5],[35,1,35,5],[19,8,19,9],[29,8,29,9],[21,8,21,9],[31,8,31,9],[32,8,32,9],[20,8,20,9],[27,8,27,9],[23,8,23,9],[26,8,26,9],[34,1,34,5],[33,8,33,9],[30,8,30,9],[31,1,31,5],[32,1,32,5],[28,8,28,9],[1,0,1,15],[4,13,4,15],[5,13,5,15],[6,13,8,15],[8,0,8,9],[8,10,8,12],[3,1,3,9],[7,5,7,10],[4,1,4,9],[5,1,5,9],[19,1,19,5],[20,1,20,5],[21,1,21,5],[25,8,25,9],[22,8,22,9],[24,8,24,9],[22,1,22,5],[24,1,24,5],[24,6,24,7],[23,6,23,7],[22,6,22,7],[21,6,21,7],[20,6,20,7],[29,1,29,5],[28,1,28,5],[25,1,25,5],[23,1,23,5],[54,0,54,5],[45,1,45,5],[48,0,48,5],[53,0,53,1],[33,1,33,5],[26,1,26,5],[27,1,27,5],[30,1,30,5],[40,1,40,5],[41,1,41,5],[46,1,46,5],[47,1,47,5],[42,1,42,5],[34,8,34,9],[44,1,44,5],[39,8,39,9],[73,8,73,10],[45,8,45,9],[36,8,36,9],[37,8,37,9],[41,8,41,9],[44,8,44,9],[67,6,67,8],[57,8,57,9],[59,0,59,2],[38,8,38,9],[35,8,35,9],[39,1,39,5],[42,8,42,9],[40,8,40,9],[68,6,68,8],[43,8,43,9],[46,8,46,9],[68,0,68,2],[60,0,61,1],[65,6,65,8],[48,8,48,9]]}
[{"$f":"\"Northern California Conference Expense Report\" & IF($U$63=TRUE,\" (REVISED)\",\"\")","v":"Northern California Conference Expense Report"}]
["Email to: payroll@nccsda.com      ",null,null,null,null,null,null,null,null,null,null,null,null,null,null,null,null,null,null,null,false]
[]
["Name",null,null,null,null,null,null,null,null,null,null,null,null,null,null,null,"Per Diem Note:"]
["Address",null,null,null,null,null,null,null,null,null,null,null,null,{"$f":"'MASTER CONTROLS'!G4","v":"2022-01-01"},null,null,"1) If you are away from home and have an overnight stay on either side of a day you qualify for per diem, choose an option with NT."]
[null,null,null,null,null,null,null,null,null,null,null,null,null,{"$f":" IF(N5<>'MASTER CONTROLS'!G3,\"Due \" & TEXT(DATE(1,MONTH(I18)+1,1),\"mmmm\") & \" 3rd.\",\"\")","v":"Due February 3rd."}]
["Best way to contact:",null,null,null,null,null,null,null,null,null,null,null,null,"*Reimbursements are made for completed reports including original receipts with travel approval from ADCO or assigned job duties. Lodging must be documented with a folio."]
["Phone:",null,null,null,"Email:",null,null,null,null,null,null,null,null,null,null,null,"2) Per diem for events that do not include an overnight stay are taxable. Spousal per diems are always taxable."]
["Please log in to APS Employee online to update your address and phone number.",null,null,null,null,null,null,null,null,null,"** ADCO must approve Special Mileage."]
["Short","Daily Activity Description",null,null,null,null,null,null,"Date",null,"Special","Per Diem",null,null,"Air/Car/Gas/Transit    Other",null,null,"PD Tx","PD NTx","Per Diem","Ans: Per"]
["Description","Example: Visitation, NCC meeting, etc.",null,null,null,null,"Budgeted Mileage",null,null,null,"Mileage**","Taxable","Non-Tax","Lodging*",null,null,null,{"$f":"$L$49","v":0},{"$f":"$M$49","v":0},"Totals","Diem"]
[]
["Worked"]
["Day Off"]
["Vacation"]
["Sick Day"]
["Holiday"]
[null,null,null,null,null,null,null,null,{"$f":"IF(N5<>'MASTER CONTROLS'!G3,N5,\"\")","v":"2022-01-01"},null,null,{"$f":"IF($U18>1,VLOOKUP($U18,'MASTER CONTROLS'!$A$3:$D$11,3,FALSE),\"\")","v":""},{"$f":"IF($U18>1,VLOOKUP($U18,'MASTER CONTROLS'!$A$3:$D$11,4,FALSE),\"\")","v":""},null,null,null,null,null,null,null,1,{"$f":"TEXT(I18,\"ddd\")","v":"Sat"}]
[null,null,null,null,null,null,null,null,{"$f":"IF(N5<>'MASTER CONTROLS'!G3,I18+1,\"\")","v":"2022-01-02"},null,null,{"$f":"IF($U19>1,VLOOKUP($U19,'MASTER CONTROLS'!$A$3:$D$11,3,FALSE),\"\")","v":""},{"$f":"IF($U19>1,VLOOKUP($U19,'MASTER CONTROLS'!$A$3:$D$11,4,FALSE),\"\")","v":""},null,null,null,null,null,null,null,1,"Sun"]
[null,null,null,null,null,null,null,null,{"$f":"IF(N5<>'MASTER CONTROLS'!G3,I19+1,\"\")","v":"2022-01-03"},null,null,{"$f":"IF($U20>1,VLOOKUP($U20,'MASTER CONTROLS'!$A$3:$D$11,3,FALSE),\"\")","v":""},{"$f":"IF($U20>1,VLOOKUP($U20,'MASTER CONTROLS'!$A$3:$D$11,4,FALSE),\"\")","v":""},null,null,null,null,null,null,null,1,"Mon"]
[null,null,null,null,null,null,null,null,{"$f":"IF(N5<>'MASTER CONTROLS'!G3,I20+1,\"\")","v":"2022-01-04"},null,null,{"$f":"IF($U21>1,VLOOKUP($U21,'MASTER CONTROLS'!$A$3:$D$11,3,FALSE),\"\")","v":""},{"$f":"IF($U21>1,VLOOKUP($U21,'MASTER CONTROLS'!$A$3:$D$11,4,FALSE),\"\")","v":""},null,null,null,null,null,null,null,1,"Tue"]
[null,null,null,null,null,null,null,null,{"$f":"IF(N5<>'MASTER CONTROLS'!G3,I21+1,\"\")","v":"2022-01-05"},null,null,{"$f":"IF($U22>1,VLOOKUP($U22,'MASTER CONTROLS'!$A$3:$D$11,3,FALSE),\"\")","v":""},{"$f":"IF($U22>1,VLOOKUP($U22,'MASTER CONTROLS'!$A$3:$D$11,4,FALSE),\"\")","v":""},null,null,null,null,null,null,null,1,"Wed"]
[null,null,null,null,null,null,null,null,{"$f":"IF(N5<>'MASTER CONTROLS'!G3,I22+1,\"\")","v":"2022-01-06"},null,null,{"$f":"IF($U23>1,VLOOKUP($U23,'MASTER CONTROLS'!$A$3:$D$11,3,FALSE),\"\")","v":""},{"$f":"IF($U23>1,VLOOKUP($U23,'MASTER CONTROLS'!$A$3:$D$11,4,FALSE),\"\")","v":""},null,null,null,null,null,null,null,1,"Thu"]
[null,null,null,null,null,null,null,null,{"$f":"IF(N5<>'MASTER CONTROLS'!G3,I23+1,\"\")","v":"2022-01-07"},null,null,{"$f":"IF($U24>1,VLOOKUP($U24,'MASTER CONTROLS'!$A$3:$D$11,3,FALSE),\"\")","v":""},{"$f":"IF($U24>1,VLOOKUP($U24,'MASTER CONTROLS'!$A$3:$D$11,4,FALSE),\"\")","v":""},null,null,null,null,null,null,null,1,"Fri"]
[null,null,null,null,null,null,null,null,{"$f":"IF(N5<>'MASTER CONTROLS'!G3,I24+1,\"\")","v":"2022-01-08"},null,null,{"$f":"IF($U25>1,VLOOKUP($U25,'MASTER CONTROLS'!$A$3:$D$11,3,FALSE),\"\")","v":""},{"$f":"IF($U25>1,VLOOKUP($U25,'MASTER CONTROLS'!$A$3:$D$11,4,FALSE),\"\")","v":""},null,null,null,null,null,null,null,1,"Sat"]
[null,null,null,null,null,null,null,null,{"$f":"IF(N5<>'MASTER CONTROLS'!G3,I25+1,\"\")","v":"2022-01-09"},null,null,{"$f":"IF($U26>1,VLOOKUP($U26,'MASTER CONTROLS'!$A$3:$D$11,3,FALSE),\"\")","v":""},{"$f":"IF($U26>1,VLOOKUP($U26,'MASTER CONTROLS'!$A$3:$D$11,4,FALSE),\"\")","v":""},null,null,null,null,null,null,null,1,"Sun"]
[null,null,null,null,null,null,null,null,{"$f":"IF(N5<>'MASTER CONTROLS'!G3,I26+1,\"\")","v":"2022-01-10"},null,null,{"$f":"IF($U27>1,VLOOKUP($U27,'MASTER CONTROLS'!$A$3:$D$11,3,FALSE),\"\")","v":""},{"$f":"IF($U27>1,VLOOKUP($U27,'MASTER CONTROLS'!$A$3:$D$11,4,FALSE),\"\")","v":""},null,null,null,null,null,null,null,1,"Mon"]
[null,null,null,null,null,null,null,null,{"$f":"IF(N5<>'MASTER CONTROLS'!G3,I27+1,\"\")","v":"2022-01-11"},null,null,{"$f":"IF($U28>1,VLOOKUP($U28,'MASTER CONTROLS'!$A$3:$D$11,3,FALSE),\"\")","v":""},{"$f":"IF($U28>1,VLOOKUP($U28,'MASTER CONTROLS'!$A$3:$D$11,4,FALSE),\"\")","v":""},null,null,null,null,null,null,null,1,"Tue"]
[null,null,null,null,null,null,null,null,{"$f":"IF(N5<>'MASTER CONTROLS'!G3,I28+1,\"\")","v":"2022-01-12"},null,null,{"$f":"IF($U29>1,VLOOKUP($U29,'MASTER CONTROLS'!$A$3:$D$11,3,FALSE),\"\")","v":""},{"$f":"IF($U29>1,VLOOKUP($U29,'MASTER CONTROLS'!$A$3:$D$11,4,FALSE),\"\")","v":""},null,null,null,null,null,null,null,1,"Wed"]
[null,null,null,null,null,null,null,null,{"$f":"IF(N5<>'MASTER CONTROLS'!G3,I29+1,\"\")","v":"2022-01-13"},null,null,{"$f":"IF($U30>1,VLOOKUP($U30,'MASTER CONTROLS'!$A$3:$D$11,3,FALSE),\"\")","v":""},{"$f":"IF($U30>1,VLOOKUP($U30,'MASTER CONTROLS'!$A$3:$D$11,4,FALSE),\"\")","v":""},null,null,null,null,null,null,null,1,"Thu"]
[null,null,null,null,null,null,null,null,{"$f":"IF(N5<>'MASTER CONTROLS'!G3,I30+1,\"\")","v":"2022-01-14"},null,null,{"$f":"IF($U31>1,VLOOKUP($U31,'MASTER CONTROLS'!$A$3:$D$11,3,FALSE),\"\")","v":""},{"$f":"IF($U31>1,VLOOKUP($U31,'MASTER CONTROLS'!$A$3:$D$11,4,FALSE),\"\")","v":""},null,null,null,null,null,null,null,1,"Fri"]
[null,null,null,null,null,null,null,null,{"$f":"IF(N5<>'MASTER CONTROLS'!G3,I31+1,\"\")","v":"2022-01-15"},null,null,{"$f":"IF($U32>1,VLOOKUP($U32,'MASTER CONTROLS'!$A$3:$D$11,3,FALSE),\"\")","v":""},{"$f":"IF($U32>1,VLOOKUP($U32,'MASTER CONTROLS'!$A$3:$D$11,4,FALSE),\"\")","v":""},null,null,null,null,null,null,null,1,"Sat"]
[null,null,null,null,null,null,null,null,{"$f":"IF(N5<>'MASTER CONTROLS'!G3,I32+1,\"\")","v":"2022-01-16"},null,null,{"$f":"IF($U33>1,VLOOKUP($U33,'MASTER CONTROLS'!$A$3:$D$11,3,FALSE),\"\")","v":""},{"$f":"IF($U33>1,VLOOKUP($U33,'MASTER CONTROLS'!$A$3:$D$11,4,FALSE),\"\")","v":""},null,null,null,null,null,null,null,1,"Sun"]
[null,null,null,null,null,null,null,null,{"$f":"IF(N5<>'MASTER CONTROLS'!G3,I33+1,\"\")","v":"2022-01-17"},null,null,{"$f":"IF($U34>1,VLOOKUP($U34,'MASTER CONTROLS'!$A$3:$D$11,3,FALSE),\"\")","v":""},{"$f":"IF($U34>1,VLOOKUP($U34,'MASTER CONTROLS'!$A$3:$D$11,4,FALSE),\"\")","v":""},null,null,null,null,null,null,null,1,"Mon"]
[null,null,null,null,null,null,null,null,{"$f":"IF(N5<>'MASTER CONTROLS'!G3,I34+1,\"\")","v":"2022-01-18"},null,null,{"$f":"IF($U35>1,VLOOKUP($U35,'MASTER CONTROLS'!$A$3:$D$11,3,FALSE),\"\")","v":""},{"$f":"IF($U35>1,VLOOKUP($U35,'MASTER CONTROLS'!$A$3:$D$11,4,FALSE),\"\")","v":""},null,null,null,null,null,null,null,1,"Tue"]
[null,null,null,null,null,null,null,null,{"$f":"IF(N5<>'MASTER CONTROLS'!G3,I35+1,\"\")","v":"2022-01-19"},null,null,{"$f":"IF($U36>1,VLOOKUP($U36,'MASTER CONTROLS'!$A$3:$D$11,3,FALSE),\"\")","v":""},{"$f":"IF($U36>1,VLOOKUP($U36,'MASTER CONTROLS'!$A$3:$D$11,4,FALSE),\"\")","v":""},null,null,null,null,null,null,null,1,"Wed"]
[null,null,null,null,null,null,null,null,{"$f":"IF(N5<>'MASTER CONTROLS'!G3,I36+1,\"\")","v":"2022-01-20"},null,null,{"$f":"IF($U37>1,VLOOKUP($U37,'MASTER CONTROLS'!$A$3:$D$11,3,FALSE),\"\")","v":""},{"$f":"IF($U37>1,VLOOKUP($U37,'MASTER CONTROLS'!$A$3:$D$11,4,FALSE),\"\")","v":""},null,null,null,null,null,null,null,1,"Thu"]
[null,null,null,null,null,null,null,null,{"$f":"IF(N5<>'MASTER CONTROLS'!G3,I37+1,\"\")","v":"2022-01-21"},null,null,{"$f":"IF($U38>1,VLOOKUP($U38,'MASTER CONTROLS'!$A$3:$D$11,3,FALSE),\"\")","v":""},{"$f":"IF($U38>1,VLOOKUP($U38,'MASTER CONTROLS'!$A$3:$D$11,4,FALSE),\"\")","v":""},null,null,null,null,null,null,null,1,"Fri"]
[null,null,null,null,null,null,null,null,{"$f":"IF(N5<>'MASTER CONTROLS'!G3,I38+1,\"\")","v":"2022-01-22"},null,null,{"$f":"IF($U39>1,VLOOKUP($U39,'MASTER CONTROLS'!$A$3:$D$11,3,FALSE),\"\")","v":""},{"$f":"IF($U39>1,VLOOKUP($U39,'MASTER CONTROLS'!$A$3:$D$11,4,FALSE),\"\")","v":""},null,null,null,null,null,null,null,1,"Sat"]
[null,null,null,null,null,null,null,null,{"$f":"IF(N5<>'MASTER CONTROLS'!G3,I39+1,\"\")","v":"2022-01-23"},null,null,{"$f":"IF($U40>1,VLOOKUP($U40,'MASTER CONTROLS'!$A$3:$D$11,3,FALSE),\"\")","v":""},{"$f":"IF($U40>1,VLOOKUP($U40,'MASTER CONTROLS'!$A$3:$D$11,4,FALSE),\"\")","v":""},null,null,null,null,null,null,null,1,"Sun"]
[null,null,null,null,null,null,null,null,{"$f":"IF(N5<>'MASTER CONTROLS'!G3,I40+1,\"\")","v":"2022-01-24"},null,null,{"$f":"IF($U41>1,VLOOKUP($U41,'MASTER CONTROLS'!$A$3:$D$11,3,FALSE),\"\")","v":""},{"$f":"IF($U41>1,VLOOKUP($U41,'MASTER CONTROLS'!$A$3:$D$11,4,FALSE),\"\")","v":""},null,null,null,null,null,null,null,1,"Mon"]
[null,null,null,null,null,null,null,null,{"$f":"IF(N5<>'MASTER CONTROLS'!G3,I41+1,\"\")","v":"2022-01-25"},null,null,{"$f":"IF($U42>1,VLOOKUP($U42,'MASTER CONTROLS'!$A$3:$D$11,3,FALSE),\"\")","v":""},{"$f":"IF($U42>1,VLOOKUP($U42,'MASTER CONTROLS'!$A$3:$D$11,4,FALSE),\"\")","v":""},null,null,null,null,null,null,null,1,"Tue"]
[null,null,null,null,null,null,null,null,{"$f":"IF(N5<>'MASTER CONTROLS'!G3,I42+1,\"\")","v":"2022-01-26"},null,null,{"$f":"IF($U43>1,VLOOKUP($U43,'MASTER CONTROLS'!$A$3:$D$11,3,FALSE),\"\")","v":""},{"$f":"IF($U43>1,VLOOKUP($U43,'MASTER CONTROLS'!$A$3:$D$11,4,FALSE),\"\")","v":""},null,null,null,null,null,null,null,1,"Wed"]
[null,null,null,null,null,null,null,null,{"$f":"IF(N5<>'MASTER CONTROLS'!G3,I43+1,\"\")","v":"2022-01-27"},null,null,{"$f":"IF($U44>1,VLOOKUP($U44,'MASTER CONTROLS'!$A$3:$D$11,3,FALSE),\"\")","v":""},{"$f":"IF($U44>1,VLOOKUP($U44,'MASTER CONTROLS'!$A$3:$D$11,4,FALSE),\"\")","v":""},null,null,null,null,null,null,null,1,"Thu"]
[null,null,null,null,null,null,null,null,{"$f":"IF(N5<>'MASTER CONTROLS'!G3,I44+1,\"\")","v":"2022-01-28"},null,null,{"$f":"IF($U45>1,VLOOKUP($U45,'MASTER CONTROLS'!$A$3:$D$11,3,FALSE),\"\")","v":""},{"$f":"IF($U45>1,VLOOKUP($U45,'MASTER CONTROLS'!$A$3:$D$11,4,FALSE),\"\")","v":""},null,null,null,null,null,null,null,1,"Fri"]
[null,null,null,null,null,null,null,null,{"$f":"IF(AND(N$5<>'MASTER CONTROLS'!$G$3,I45<VLOOKUP(N$5,'MASTER CONTROLS'!$G$3:$I$15,3)),I45+1,\"\")","v":"2022-01-29"},null,null,{"$f":"IF($U46>1,VLOOKUP($U46,'MASTER CONTROLS'!$A$3:$D$11,3,FALSE),\"\")","v":""},{"$f":"IF($U46>1,VLOOKUP($U46,'MASTER CONTROLS'!$A$3:$D$11,4,FALSE),\"\")","v":""},null,null,null,null,null,null,null,1,"Sat"]
[null,null,null,null,null,null,null,null,{"$f":"IF(AND(N$5<>'MASTER CONTROLS'!$G$3,I46<VLOOKUP(N$5,'MASTER CONTROLS'!$G$3:$I$15,3)),I46+1,\"\")","v":"2022-01-30"},null,null,{"$f":"IF($U47>1,VLOOKUP($U47,'MASTER CONTROLS'!$A$3:$D$11,3,FALSE),\"\")","v":""},{"$f":"IF($U47>1,VLOOKUP($U47,'MASTER CONTROLS'!$A$3:$D$11,4,FALSE),\"\")","v":""},null,null,null,null,null,null,null,1,"Sun"]
[null,null,null,null,null,null,null,null,{"$f":"IF(AND(N$5<>'MASTER CONTROLS'!$G$3,I47<VLOOKUP(N$5,'MASTER CONTROLS'!$G$3:$I$15,3)),I47+1,\"\")","v":"2022-01-31"},null,null,{"$f":"IF($U48>1,VLOOKUP($U48,'MASTER CONTROLS'!$A$3:$D$11,3,FALSE),\"\")","v":""},{"$f":"IF($U48>1,VLOOKUP($U48,'MASTER CONTROLS'!$A$3:$D$11,4,FALSE),\"\")","v":""},null,null,null,null,null,null,null,1,"Mon"]
["TOTALS",null,null,null,null,null,{"$f":"SUM(G18:H48)","v":0},null,null,null,{"$f":"SUM(K18:K48)","v":0},0,0,0,0,0]
[]
["Office Staff Section",null,null,null,null,null,null,null,null,null,null,null,null,"Phone","Internet","Total"]
[null,null,null,null,null,null,null,null,null,null,null,null,null,null,null,{"$f":"SUM(N52:O52)","v":0}]
[]
["Pastor's Section",null,null,null,null,null,null,null,"Profession of Faith",null,null,"Worship Service Attendance"]
["Church Name ",null,null,null,null,null,null,"Baptisms",null,null,"Transfers","Week 1","Week 2","Week 3","Week 4","Week 5"]
[null,null,null,null,null,null,null,null,null,null,null,null,null,null,null,null,{"$f":"COUNTIF(V18:V48,\"Sat\")","v":5},{"$f":"COUNT(G56:P56)","v":0}]
[]
[]
[]
[]
["Comments & Notes"]
[]
[null,null,null,null,null,null,null,null,null,null,null,null,null,null,null,null,null,null,null,null,false]
[]
["OFFICE USE ONLY"]
["10200) Travel Budget",null,null,null,null,null,"10201) Per Diem Tx",null,null,null,null,null,"11206) Travel Misc"]
["11211) Non-Tax Miles",null,null,null,null,null,"11201) Per Diem NTx",null,null,null,null,null,"11230) Conv./Mtgs"]
["11200) Special Miles",null,null,null,null,null,"11202) Lodging",null,null,null,null,null,"11403) Phone"]
["10212) Spouse Travel",null,null,null,null,null,"11203) Car Rental",null,null,null,null,null,"10408) Internet"]
["11405) Entertainment",null,null,null,null,null,"11209) Airfare Travel"]

{"sheet":"Feb","index":2,"n_rows":70,"n_cols":22,"rows_kept":70,"cut":false,"hidden":false,"merged":[[69,6,69,7],[17,6,17,7],[10,6,10,7],[26,6,26,7],[25,6,25,7],[24,6,24,7],[23,6,23,7],[22,6,22,7],[20,6,20,7],[21,6,21,7],[19,6,19,7],[18,6,18,7],[35,6,35,7],[34,6,34,7],[33,6,33,7],[32,6,32,7],[31,6,31,7],[30,6,30,7],[29,6,29,7],[28,6,28,7],[27,6,27,7],[24,1,24,5],[26,1,26,5],[26,8,26,9],[30,8,30,9],[0,0,0,15],[37,1,37,5],[38,1,38,5],[9,1,9,5],[10,1,10,5],[17,1,17,5],[9,14,10,15],[9,6,9,7],[35,8,35,9],[1,0,1,15],[8,0,8,9],[8,10,8,12],[3,1,3,9],[7,5,7,10],[4,1,4,9],[33,1,33,5],[33,8,33,9],[19,1,19,5],[20,1,20,5],[22,1,22,5],[25,1,25,5],[27,1,27,5],[23,1,23,5],[68,14,68,15],[65,14,65,15],[66,14,66,15],[38,8,38,9],[36,8,36,9],[41,8,41,9],[44,8,44,9],[37,8,37,9],[66,12,66,13],[66,0,66,2],[53,0,53,1],[48,8,48,9],[53,8,54,9],[51,0,51,12],[56,0,56,6],[65,0,65,2],[67,14,67,15],[65,12,65,13],[67,6,67,8],[68,6,68,8],[28,8,28,9],[69,12,69,13],[67,12,67,13],[46,8,46,9],[66,6,66,8],[66,3,66,4],[67,3,67,4],[68,12,68,13],[57,8,57,9],[59,6,59,8],[57,0,57,6],[65,6,65,8],[46,1,46,5],[47,1,47,5],[59,0,59,2],[68,3,68,4],[68,0,68,2],[64,0,64,15],[65,3,65,4],[55,0,55,6],[48,6,48,7],[47,6,47,7],[46,6,46,7],[67,0,67,2],[69,0,69,1],[18,1,18,5],[18,8,18,9],[21,8,21,9],[40,8,40,9],[31,8,31,9],[32,8,32,9],[60,2,61,15],[59,11,59,12],[53,11,53,15],[60,0,61,1],[54,0,54,5],[59,13,59,14],[28,1,28,5],[45,1,45,5],[48,0,48,5],[59,9,59,10],[43,1,43,5],[42,8,42,9],[29,8,29,9],[50,0,50,2],[47,8,47,9],[56,8,56,9],[55,8,55,9],[25,8,25,9],[20,8,20,9],[27,8,27,9],[23,8,23,9],[22,8,22,9],[24,8,24,9],[34,8,34,9],[3,16,3,19],[4,16,6,19],[7,16,7,19],[6,0,6,9],[7,1,7,3],[9,11,9,12],[9,8,10,9],[4,13,4,15],[5,13,5,15],[6,13,8,15],[5,1,5,9],[34,1,34,5],[29,1,29,5],[19,8,19,9],[31,1,31,5],[32,1,32,5],[30,1,30,5],[17,8,17,9],[36,1,36,5],[35,1,35,5],[39,1,39,5],[40,1,40,5],[43,8,43,9],[39,8,39,9],[41,1,41,5],[42,1,42,5],[45,8,45,9],[44,1,44,5],[45,6,45,7],[44,6,44,7],[43,6,43,7],[42,6,42,7],[41,6,41,7],[40,6,40,7],[39,6,39,7],[38,6,38,7],[37,6,37,7],[36,6,36,7]]}
[{"$f":"\"Northern California Conference Expense Report\" & IF($U$63=TRUE,\" (REVISED)\",\"\")","v":"Northern California Conference Expense Report"}]
[{"$f":"Jan!A2","v":"Email to: payroll@nccsda.com      "},null,null,null,null,null,null,null,null,null,null,null,null,null,null,null,null,null,null,null,false]
[]
["Name",{"$f":"IF(Jan!B4<>\"\",Jan!B4,\"\")","v":""},null,null,null,null,null,null,null,null,null,null,null,null,null,null,"Per Diem Note:"]
["Address",{"$f":"IF(Jan!B5<>\"\",Jan!B5,\"\")","v":""},null,null,null,null,null,null,null,null,null,null,null,{"$f":"'MASTER CONTROLS'!G5","v":"2022-02-01"},null,null,"1) If you are away from home and have an overnight stay on either side of a day you qualify for per diem, choose an option with NT."]
[null,{"$f":"IF(Jan!B6<>\"\",Jan!B6,\"\")","v":""},null,null,null,null,null,null,null,null,null,null,null,{"$f":" IF(N5<>'MASTER CONTROLS'!G3,\"Due \" & TEXT(DATE(1,MONTH(I18)+1,1),\"mmmm\") & \" 3rd.\",\"\")","v":"Due March 3rd."}]
["Best way to contact:",null,null,null,null,null,null,null,null,null,null,null,null,"*Reimbursements are made for completed reports including original receipts with travel approval from ADCO or assigned job duties. Lodging must be documented with a folio."]
["Phone:",{"$f":"IF(Jan!B8<>\"\",Jan!B8,\"\")","v":""},null,null,"Email:",{"$f":"IF(Jan!F8<>\"\",Jan!F8,\"\")","v":""},null,null,{"$f":"IF(Jan!I8<>\"\",Jan!I8,\"\")","v":""},null,null,null,null,null,null,null,{"$f":"Jan!Q8","v":"2) Per diem for events that do not include an overnight stay are taxable. Spousal per diems are always taxable."}]
[{"$f":"Jan!A9","v":"Please log in to APS Employee online to update your address and phone number."},null,null,null,null,null,null,null,null,null,"** ADCO must approve Special Mileage."]
["Short","Daily Activity Description",null,null,null,null,null,null,"Date",null,"Special","Per Diem",null,null,"Air/Car/Gas/Transit    Other",null,null,"PD Tx","PD NTx","Per Diem","Ans: Per"]
["Description","Example: Visitation, Sermon Prep, etc.",null,null,null,null,"Budgeted Mileage",null,null,null,"Mileage**","Taxable","Non-Tax","Lodging*",null,null,null,{"$f":"$L$49","v":0},{"$f":"$M$49","v":0},"Totals","Diem"]
[]
["Worked"]
["Day Off"]
["Vacation"]
["Sick Day"]
["Holiday"]
[null,null,null,null,null,null,null,null,{"$f":"IF(N5<>'MASTER CONTROLS'!G3,N5,\"\")","v":"2022-02-01"},null,null,{"$f":"IF($U18>1,VLOOKUP($U18,'MASTER CONTROLS'!$A$3:$D$11,3,FALSE),\"\")","v":""},{"$f":"IF($U18>1,VLOOKUP($U18,'MASTER CONTROLS'!$A$3:$D$11,4,FALSE),\"\")","v":""},null,null,null,null,null,null,null,1,{"$f":"TEXT(I18,\"ddd\")","v":"Tue"}]
[null,null,null,null,null,null,null,null,{"$f":"IF(N5<>'MASTER CONTROLS'!G3,I18+1,\"\")","v":"2022-02-02"},null,null,{"$f":"IF($U19>1,VLOOKUP($U19,'MASTER CONTROLS'!$A$3:$D$11,3,FALSE),\"\")","v":""},{"$f":"IF($U19>1,VLOOKUP($U19,'MASTER CONTROLS'!$A$3:$D$11,4,FALSE),\"\")","v":""},null,null,null,null,null,null,null,1,"Wed"]
[null,null,null,null,null,null,null,null,{"$f":"IF(N5<>'MASTER CONTROLS'!G3,I19+1,\"\")","v":"2022-02-03"},null,null,{"$f":"IF($U20>1,VLOOKUP($U20,'MASTER CONTROLS'!$A$3:$D$11,3,FALSE),\"\")","v":""},{"$f":"IF($U20>1,VLOOKUP($U20,'MASTER CONTROLS'!$A$3:$D$11,4,FALSE),\"\")","v":""},null,null,null,null,null,null,null,1,"Thu"]
[null,null,null,null,null,null,null,null,{"$f":"IF(N5<>'MASTER CONTROLS'!G3,I20+1,\"\")","v":"2022-02-04"},null,null,{"$f":"IF($U21>1,VLOOKUP($U21,'MASTER CONTROLS'!$A$3:$D$11,3,FALSE),\"\")","v":""},{"$f":"IF($U21>1,VLOOKUP($U21,'MASTER CONTROLS'!$A$3:$D$11,4,FALSE),\"\")","v":""},null,null,null,null,null,null,null,1,"Fri"]
[null,null,null,null,null,null,null,null,{"$f":"IF(N5<>'MASTER CONTROLS'!G3,I21+1,\"\")","v":"2022-02-05"},null,null,{"$f":"IF($U22>1,VLOOKUP($U22,'MASTER CONTROLS'!$A$3:$D$11,3,FALSE),\"\")","v":""},{"$f":"IF($U22>1,VLOOKUP($U22,'MASTER CONTROLS'!$A$3:$D$11,4,FALSE),\"\")","v":""},null,null,null,null,null,null,null,1,"Sat"]
[null,null,null,null,null,null,null,null,{"$f":"IF(N5<>'MASTER CONTROLS'!G3,I22+1,\"\")","v":"2022-02-06"},null,null,{"$f":"IF($U23>1,VLOOKUP($U23,'MASTER CONTROLS'!$A$3:$D$11,3,FALSE),\"\")","v":""},{"$f":"IF($U23>1,VLOOKUP($U23,'MASTER CONTROLS'!$A$3:$D$11,4,FALSE),\"\")","v":""},null,null,null,null,null,null,null,1,"Sun"]
[null,null,null,null,null,null,null,null,{"$f":"IF(N5<>'MASTER CONTROLS'!G3,I23+1,\"\")","v":"2022-02-07"},null,null,{"$f":"IF($U24>1,VLOOKUP($U24,'MASTER CONTROLS'!$A$3:$D$11,3,FALSE),\"\")","v":""},{"$f":"IF($U24>1,VLOOKUP($U24,'MASTER CONTROLS'!$A$3:$D$11,4,FALSE),\"\")","v":""},null,null,null,null,null,null,null,1,"Mon"]
[null,null,null,null,null,null,null,null,{"$f":"IF(N5<>'MASTER CONTROLS'!G3,I24+1,\"\")","v":"2022-02-08"},null,null,{"$f":"IF($U25>1,VLOOKUP($U25,'MASTER CONTROLS'!$A$3:$D$11,3,FALSE),\"\")","v":""},{"$f":"IF($U25>1,VLOOKUP($U25,'MASTER CONTROLS'!$A$3:$D$11,4,FALSE),\"\")","v":""},null,null,null,null,null,null,null,1,"Tue"]
[null,null,null,null,null,null,null,null,{"$f":"IF(N5<>'MASTER CONTROLS'!G3,I25+1,\"\")","v":"2022-02-09"},null,null,{"$f":"IF($U26>1,VLOOKUP($U26,'MASTER CONTROLS'!$A$3:$D$11,3,FALSE),\"\")","v":""},{"$f":"IF($U26>1,VLOOKUP($U26,'MASTER CONTROLS'!$A$3:$D$11,4,FALSE),\"\")","v":""},null,null,null,null,null,null,null,1,"Wed"]
[null,null,null,null,null,null,null,null,{"$f":"IF(N5<>'MASTER CONTROLS'!G3,I26+1,\"\")","v":"2022-02-10"},null,null,{"$f":"IF($U27>1,VLOOKUP($U27,'MASTER CONTROLS'!$A$3:$D$11,3,FALSE),\"\")","v":""},{"$f":"IF($U27>1,VLOOKUP($U27,'MASTER CONTROLS'!$A$3:$D$11,4,FALSE),\"\")","v":""},null,null,null,null,null,null,null,1,"Thu"]
[null,null,null,null,null,null,null,null,{"$f":"IF(N5<>'MASTER CONTROLS'!G3,I27+1,\"\")","v":"2022-02-11"},null,null,{"$f":"IF($U28>1,VLOOKUP($U28,'MASTER CONTROLS'!$A$3:$D$11,3,FALSE),\"\")","v":""},{"$f":"IF($U28>1,VLOOKUP($U28,'MASTER CONTROLS'!$A$3:$D$11,4,FALSE),\"\")","v":""},null,null,null,null,null,null,null,1,"Fri"]
[null,null,null,null,null,null,null,null,{"$f":"IF(N5<>'MASTER CONTROLS'!G3,I28+1,\"\")","v":"2022-02-12"},null,null,{"$f":"IF($U29>1,VLOOKUP($U29,'MASTER CONTROLS'!$A$3:$D$11,3,FALSE),\"\")","v":""},{"$f":"IF($U29>1,VLOOKUP($U29,'MASTER CONTROLS'!$A$3:$D$11,4,FALSE),\"\")","v":""},null,null,null,null,null,null,null,1,"Sat"]
[null,null,null,null,null,null,null,null,{"$f":"IF(N5<>'MASTER CONTROLS'!G3,I29+1,\"\")","v":"2022-02-13"},null,null,{"$f":"IF($U30>1,VLOOKUP($U30,'MASTER CONTROLS'!$A$3:$D$11,3,FALSE),\"\")","v":""},{"$f":"IF($U30>1,VLOOKUP($U30,'MASTER CONTROLS'!$A$3:$D$11,4,FALSE),\"\")","v":""},null,null,null,null,null,null,null,1,"Sun"]
[null,null,null,null,null,null,null,null,{"$f":"IF(N5<>'MASTER CONTROLS'!G3,I30+1,\"\")","v":"2022-02-14"},null,null,{"$f":"IF($U31>1,VLOOKUP($U31,'MASTER CONTROLS'!$A$3:$D$11,3,FALSE),\"\")","v":""},{"$f":"IF($U31>1,VLOOKUP($U31,'MASTER CONTROLS'!$A$3:$D$11,4,FALSE),\"\")","v":""},null,null,null,null,null,null,null,1,"Mon"]
[null,null,null,null,null,null,null,null,{"$f":"IF(N5<>'MASTER CONTROLS'!G3,I31+1,\"\")","v":"2022-02-15"},null,null,{"$f":"IF($U32>1,VLOOKUP($U32,'MASTER CONTROLS'!$A$3:$D$11,3,FALSE),\"\")","v":""},{"$f":"IF($U32>1,VLOOKUP($U32,'MASTER CONTROLS'!$A$3:$D$11,4,FALSE),\"\")","v":""},null,null,null,null,null,null,null,1,"Tue"]
[null,null,null,null,null,null,null,null,{"$f":"IF(N5<>'MASTER CONTROLS'!G3,I32+1,\"\")","v":"2022-02-16"},null,null,{"$f":"IF($U33>1,VLOOKUP($U33,'MASTER CONTROLS'!$A$3:$D$11,3,FALSE),\"\")","v":""},{"$f":"IF($U33>1,VLOOKUP($U33,'MASTER CONTROLS'!$A$3:$D$11,4,FALSE),\"\")","v":""},null,null,null,null,null,null,null,1,"Wed"]
[null,null,null,null,null,null,null,null,{"$f":"IF(N5<>'MASTER CONTROLS'!G3,I33+1,\"\")","v":"2022-02-17"},null,null,{"$f":"IF($U34>1,VLOOKUP($U34,'MASTER CONTROLS'!$A$3:$D$11,3,FALSE),\"\")","v":""},{"$f":"IF($U34>1,VLOOKUP($U34,'MASTER CONTROLS'!$A$3:$D$11,4,FALSE),\"\")","v":""},null,null,null,null,null,null,null,1,"Thu"]
[null,null,null,null,null,null,null,null,{"$f":"IF(N5<>'MASTER CONTROLS'!G3,I34+1,\"\")","v":"2022-02-18"},null,null,{"$f":"IF($U35>1,VLOOKUP($U35,'MASTER CONTROLS'!$A$3:$D$11,3,FALSE),\"\")","v":""},{"$f":"IF($U35>1,VLOOKUP($U35,'MASTER CONTROLS'!$A$3:$D$11,4,FALSE),\"\")","v":""},null,null,null,null,null,null,null,1,"Fri"]
[null,null,null,null,null,null,null,null,{"$f":"IF(N5<>'MASTER CONTROLS'!G3,I35+1,\"\")","v":"2022-02-19"},null,null,{"$f":"IF($U36>1,VLOOKUP($U36,'MASTER CONTROLS'!$A$3:$D$11,3,FALSE),\"\")","v":""},{"$f":"IF($U36>1,VLOOKUP($U36,'MASTER CONTROLS'!$A$3:$D$11,4,FALSE),\"\")","v":""},null,null,null,null,null,null,null,1,"Sat"]
[null,null,null,null,null,null,null,null,{"$f":"IF(N5<>'MASTER CONTROLS'!G3,I36+1,\"\")","v":"2022-02-20"},null,null,{"$f":"IF($U37>1,VLOOKUP($U37,'MASTER CONTROLS'!$A$3:$D$11,3,FALSE),\"\")","v":""},{"$f":"IF($U37>1,VLOOKUP($U37,'MASTER CONTROLS'!$A$3:$D$11,4,FALSE),\"\")","v":""},null,null,null,null,null,null,null,1,"Sun"]
[null,null,null,null,null,null,null,null,{"$f":"IF(N5<>'MASTER CONTROLS'!G3,I37+1,\"\")","v":"2022-02-21"},null,null,{"$f":"IF($U38>1,VLOOKUP($U38,'MASTER CONTROLS'!$A$3:$D$11,3,FALSE),\"\")","v":""},{"$f":"IF($U38>1,VLOOKUP($U38,'MASTER CONTROLS'!$A$3:$D$11,4,FALSE),\"\")","v":""},null,null,null,null,null,null,null,1,"Mon"]
[null,null,null,null,null,null,null,null,{"$f":"IF(N5<>'MASTER CONTROLS'!G3,I38+1,\"\")","v":"2022-02-22"},null,null,{"$f":"IF($U39>1,VLOOKUP($U39,'MASTER CONTROLS'!$A$3:$D$11,3,FALSE),\"\")","v":""},{"$f":"IF($U39>1,VLOOKUP($U39,'MASTER CONTROLS'!$A$3:$D$11,4,FALSE),\"\")","v":""},null,null,null,null,null,null,null,1,"Tue"]
[null,null,null,null,null,null,null,null,{"$f":"IF(N5<>'MASTER CONTROLS'!G3,I39+1,\"\")","v":"2022-02-23"},null,null,{"$f":"IF($U40>1,VLOOKUP($U40,'MASTER CONTROLS'!$A$3:$D$11,3,FALSE),\"\")","v":""},{"$f":"IF($U40>1,VLOOKUP($U40,'MASTER CONTROLS'!$A$3:$D$11,4,FALSE),\"\")","v":""},null,null,null,null,null,null,null,1,"Wed"]
[null,null,null,null,null,null,null,null,{"$f":"IF(N5<>'MASTER CONTROLS'!G3,I40+1,\"\")","v":"2022-02-24"},null,null,{"$f":"IF($U41>1,VLOOKUP($U41,'MASTER CONTROLS'!$A$3:$D$11,3,FALSE),\"\")","v":""},{"$f":"IF($U41>1,VLOOKUP($U41,'MASTER CONTROLS'!$A$3:$D$11,4,FALSE),\"\")","v":""},null,null,null,null,null,null,null,1,"Thu"]
[null,null,null,null,null,null,null,null,{"$f":"IF(N5<>'MASTER CONTROLS'!G3,I41+1,\"\")","v":"2022-02-25"},null,null,{"$f":"IF($U42>1,VLOOKUP($U42,'MASTER CONTROLS'!$A$3:$D$11,3,FALSE),\"\")","v":""},{"$f":"IF($U42>1,VLOOKUP($U42,'MASTER CONTROLS'!$A$3:$D$11,4,FALSE),\"\")","v":""},null,null,null,null,null,null,null,1,"Fri"]
[null,null,null,null,null,null,null,null,{"$f":"IF(N5<>'MASTER CONTROLS'!G3,I42+1,\"\")","v":"2022-02-26"},null,null,{"$f":"IF($U43>1,VLOOKUP($U43,'MASTER CONTROLS'!$A$3:$D$11,3,FALSE),\"\")","v":""},{"$f":"IF($U43>1,VLOOKUP($U43,'MASTER CONTROLS'!$A$3:$D$11,4,FALSE),\"\")","v":""},null,null,null,null,null,null,null,1,"Sat"]
[null,null,null,null,null,null,null,null,{"$f":"IF(N5<>'MASTER CONTROLS'!G3,I43+1,\"\")","v":"2022-02-27"},null,null,{"$f":"IF($U44>1,VLOOKUP($U44,'MASTER CONTROLS'!$A$3:$D$11,3,FALSE),\"\")","v":""},{"$f":"IF($U44>1,VLOOKUP($U44,'MASTER CONTROLS'!$A$3:$D$11,4,FALSE),\"\")","v":""},null,null,null,null,null,null,null,1,"Sun"]
[null,null,null,null,null,null,null,null,{"$f":"IF(N5<>'MASTER CONTROLS'!G3,I44+1,\"\")","v":"2022-02-28"},null,null,{"$f":"IF($U45>1,VLOOKUP($U45,'MASTER CONTROLS'!$A$3:$D$11,3,FALSE),\"\")","v":""},{"$f":"IF($U45>1,VLOOKUP($U45,'MASTER CONTROLS'!$A$3:$D$11,4,FALSE),\"\")","v":""},null,null,null,null,null,null,null,1,"Mon"]
[null,null,null,null,null,null,null,null,null,null,null,{"$f":"IF($U46>1,VLOOKUP($U46,'MASTER CONTROLS'!$A$3:$D$11,3,FALSE),\"\")","v":""},{"$f":"IF($U46>1,VLOOKUP($U46,'MASTER CONTROLS'!$A$3:$D$11,4,FALSE),\"\")","v":""},null,null,null,null,null,null,null,1,"Sat"]
[null,null,null,null,null,null,null,null,null,null,null,{"$f":"IF($U47>1,VLOOKUP($U47,'MASTER CONTROLS'!$A$3:$D$11,3,FALSE),\"\")","v":""},{"$f":"IF($U47>1,VLOOKUP($U47,'MASTER CONTROLS'!$A$3:$D$11,4,FALSE),\"\")","v":""},null,null,null,null,null,null,null,1,"Sat"]
[null,null,null,null,null,null,null,null,null,null,null,{"$f":"IF($U48>1,VLOOKUP($U48,'MASTER CONTROLS'!$A$3:$D$11,3,FALSE),\"\")","v":""},{"$f":"IF($U48>1,VLOOKUP($U48,'MASTER CONTROLS'!$A$3:$D$11,4,FALSE),\"\")","v":""},null,null,null,null,null,null,null,1,"Sat"]
["TOTALS",null,null,null,null,null,{"$f":"SUM(G18:H48)","v":0},null,null,null,{"$f":"SUM(K18:K48)","v":0},0,0,0,0,0]
[]
["Office Staff Section",null,null,null,null,null,null,null,null,null,null,null,null,"Phone","Internet","Total"]
[null,null,null,null,null,null,null,null,null,null,null,null,null,null,null,{"$f":"SUM(N52:O52)","v":0}]
[]
["Pastor's Section",null,null,null,null,null,null,null,{"$f":"Jan!I54","v":"Profession of Faith"},null,null,"Worship Service Attendance"]
[{"$f":"Jan!A55","v":"Church Name "},null,null,null,null,null,null,"Baptisms",null,null,"Transfers","Week 1","Week 2","Week 3","Week 4","Week 5"]
[null,null,null,null,null,null,null,null,null,null,null,null,null,null,null,null,{"$f":"COUNTIF(V18:V48,\"Sat\")","v":7},{"$f":"COUNT(G56:P56)","v":0}]
[]
[]
[]
[]
["Comments & Notes"]
[]
[null,null,null,null,null,null,null,null,null,null,null,null,null,null,null,null,null,null,null,null,false]
[]
["OFFICE USE ONLY"]
["10200) Travel Budget",null,null,null,null,null,"10201) Per Diem Tx",null,null,null,null,null,"11206) Travel Misc"]
["11211) Non-Tax Miles",null,null,null,null,null,"11201) Per Diem NTx",null,null,null,null,null,"11230) Conv./Mtgs"]
["11200) Special Miles",null,null,null,null,null,"11202) Lodging",null,null,null,null,null,"11403) Phone"]
["10212) Spouse Travel",null,null,null,null,null,"11203) Car Rental",null,null,null,null,null,"10408) Internet"]
["11405) Entertainment",null,null,null,null,null,"11209) Airfare Travel"]

{"sheet":"Mar","index":3,"n_rows":70,"n_cols":22,"rows_kept":70,"cut":false,"hidden":false,"merged":[[67,0,67,2],[69,0,69,1],[69,6,69,7],[20,1,20,5],[21,6,21,7],[20,6,20,7],[19,6,19,7],[18,6,18,7],[17,6,17,7],[68,3,68,4],[46,6,46,7],[45,6,45,7],[44,6,44,7],[43,6,43,7],[42,6,42,7],[41,6,41,7],[37,6,37,7],[36,6,36,7],[35,6,35,7],[3,16,3,19],[4,16,6,19],[7,16,7,19],[6,0,6,9],[7,1,7,3],[9,11,9,12],[9,8,10,9],[69,12,69,13],[41,1,41,5],[46,1,46,5],[47,1,47,5],[42,1,42,5],[44,1,44,5],[67,6,67,8],[64,0,64,15],[66,3,66,4],[67,3,67,4],[68,12,68,13],[66,0,66,2],[67,12,67,13],[66,12,66,13],[44,8,44,9],[68,14,68,15],[59,0,59,2],[0,0,0,15],[37,1,37,5],[38,1,38,5],[9,1,9,5],[10,1,10,5],[9,6,9,7],[36,1,36,5],[35,1,35,5],[19,8,19,9],[21,8,21,9],[22,1,22,5],[24,1,24,5],[26,1,26,5],[25,1,25,5],[28,1,28,5],[31,1,31,5],[32,1,32,5],[20,8,20,9],[22,8,22,9],[24,8,24,9],[18,8,18,9],[1,0,1,15],[21,1,21,5],[36,8,36,9],[29,1,29,5],[30,1,30,5],[18,1,18,5],[4,13,4,15],[5,13,5,15],[6,13,8,15],[8,0,8,9],[8,10,8,12],[28,8,28,9],[27,1,27,5],[27,8,27,9],[30,8,30,9],[29,8,29,9],[10,6,10,7],[30,6,30,7],[29,6,29,7],[28,6,28,7],[27,6,27,7],[26,6,26,7],[25,6,25,7],[24,6,24,7],[23,6,23,7],[22,6,22,7],[3,1,3,9],[7,5,7,10],[4,1,4,9],[5,1,5,9],[17,1,17,5],[9,14,10,15],[17,8,17,9],[19,1,19,5],[26,8,26,9],[23,8,23,9],[23,1,23,5],[25,8,25,9],[31,8,31,9],[32,8,32,9],[39,8,39,9],[40,1,40,5],[43,1,43,5],[34,1,34,5],[33,8,33,9],[38,8,38,9],[40,8,40,9],[33,1,33,5],[43,8,43,9],[34,8,34,9],[42,8,42,9],[41,8,41,9],[39,1,39,5],[38,6,38,7],[40,6,40,7],[39,6,39,7],[37,8,37,9],[35,8,35,9],[34,6,34,7],[33,6,33,7],[32,6,32,7],[31,6,31,7],[47,8,47,9],[56,8,56,9],[59,6,59,8],[57,0,57,6],[65,6,65,8],[65,14,65,15],[48,0,48,5],[65,3,65,4],[55,0,55,6],[56,0,56,6],[47,6,47,7],[48,6,48,7],[46,8,46,9],[66,6,66,8],[45,8,45,9],[60,0,61,1],[54,0,54,5],[45,1,45,5],[55,8,55,9],[57,8,57,9],[68,0,68,2],[53,0,53,1],[48,8,48,9],[53,8,54,9],[51,0,51,12],[50,0,50,2],[53,11,53,15],[65,12,65,13],[59,9,59,10],[68,6,68,8],[60,2,61,15],[59,11,59,12],[66,14,66,15],[67,14,67,15],[65,0,65,2],[59,13,59,14]]}
[{"$f":"\"Northern California Conference Expense Report\" & IF($U$63=TRUE,\" (REVISED)\",\"\")","v":"Northern California Conference Expense Report"}]
[{"$f":"Jan!A2","v":"Email to: payroll@nccsda.com      "},null,null,null,null,null,null,null,null,null,null,null,null,null,null,null,null,null,null,null,false]
[]
["Name",{"$f":"IF(Feb!B4<>\"\",Feb!B4,\"\")","v":""},null,null,null,null,null,null,null,null,null,null,null,null,null,null,"Per Diem Note:"]
["Address",{"$f":"IF(Feb!B5<>\"\",Feb!B5,\"\")","v":""},null,null,null,null,null,null,null,null,null,null,null,{"$f":"'MASTER CONTROLS'!G6","v":"2022-03-01"},null,null,"1) If you are away from home and have an overnight stay on either side of a day you qualify for per diem, choose an option with NT."]
[null,{"$f":"IF(Feb!B6<>\"\",Feb!B6,\"\")","v":""},null,null,null,null,null,null,null,null,null,null,null,{"$f":" IF(N5<>'MASTER CONTROLS'!G3,\"Due \" & TEXT(DATE(1,MONTH(I18)+1,1),\"mmmm\") & \" 3rd.\",\"\")","v":"Due April 3rd."}]
["Best way to contact:",null,null,null,null,null,null,null,null,null,null,null,null,"*Reimbursements are made for completed reports including original receipts with travel approval from ADCO or assigned job duties. Lodging must be documented with a folio."]
["Phone:",{"$f":"IF(Feb!B8<>\"\",Feb!B8,\"\")","v":""},null,null,"Email:",{"$f":"IF(Feb!F8<>\"\",Feb!F8,\"\")","v":""},null,null,{"$f":"IF(Jan!I8<>\"\",Jan!I8,\"\")","v":""},null,null,null,null,null,null,null,{"$f":"Jan!Q8","v":"2) Per diem for events that do not include an overnight stay are taxable. Spousal per diems are always taxable."}]
[{"$f":"Jan!A9","v":"Please log in to APS Employee online to update your address and phone number."},null,null,null,null,null,null,null,null,null,"** ADCO must approve Special Mileage."]
["Short","Daily Activity Description",null,null,null,null,null,null,"Date",null,"Special","Per Diem",null,null,"Air/Car/Gas/Transit    Other",null,null,"PD Tx","PD NTx","Per Diem","Ans: Per"]
["Description","Example: Visitation, Sermon Prep, etc.",null,null,null,null,"Budgeted Mileage",null,null,null,"Mileage**","Taxable","Non-Tax","Lodging*",null,null,null,{"$f":"$L$49","v":0},{"$f":"$M$49","v":0},"Totals","Diem"]
[]
["Worked"]
["Day Off"]
["Vacation"]
["Sick Day"]
["Holiday"]
[null,null,null,null,null,null,null,null,{"$f":"IF(N5<>'MASTER CONTROLS'!G3,N5,\"\")","v":"2022-03-01"},null,null,{"$f":"IF($U18>1,VLOOKUP($U18,'MASTER CONTROLS'!$A$3:$D$11,3,FALSE),\"\")","v":""},{"$f":"IF($U18>1,VLOOKUP($U18,'MASTER CONTROLS'!$A$3:$D$11,4,FALSE),\"\")","v":""},null,null,null,null,null,null,null,1,{"$f":"TEXT(I18,\"ddd\")","v":"Tue"}]
[null,null,null,null,null,null,null,null,{"$f":"IF(N5<>'MASTER CONTROLS'!G3,I18+1,\"\")","v":"2022-03-02"},null,null,{"$f":"IF($U19>1,VLOOKUP($U19,'MASTER CONTROLS'!$A$3:$D$11,3,FALSE),\"\")","v":""},{"$f":"IF($U19>1,VLOOKUP($U19,'MASTER CONTROLS'!$A$3:$D$11,4,FALSE),\"\")","v":""},null,null,null,null,null,null,null,1,"Wed"]
[null,null,null,null,null,null,null,null,{"$f":"IF(N5<>'MASTER CONTROLS'!G3,I19+1,\"\")","v":"2022-03-03"},null,null,{"$f":"IF($U20>1,VLOOKUP($U20,'MASTER CONTROLS'!$A$3:$D$11,3,FALSE),\"\")","v":""},{"$f":"IF($U20>1,VLOOKUP($U20,'MASTER CONTROLS'!$A$3:$D$11,4,FALSE),\"\")","v":""},null,null,null,null,null,null,null,1,"Thu"]
[null,null,null,null,null,null,null,null,{"$f":"IF(N5<>'MASTER CONTROLS'!G3,I20+1,\"\")","v":"2022-03-04"},null,null,{"$f":"IF($U21>1,VLOOKUP($U21,'MASTER CONTROLS'!$A$3:$D$11,3,FALSE),\"\")","v":""},{"$f":"IF($U21>1,VLOOKUP($U21,'MASTER CONTROLS'!$A$3:$D$11,4,FALSE),\"\")","v":""},null,null,null,null,null,null,null,1,"Fri"]
[null,null,null,null,null,null,null,null,{"$f":"IF(N5<>'MASTER CONTROLS'!G3,I21+1,\"\")","v":"2022-03-05"},null,null,{"$f":"IF($U22>1,VLOOKUP($U22,'MASTER CONTROLS'!$A$3:$D$11,3,FALSE),\"\")","v":""},{"$f":"IF($U22>1,VLOOKUP($U22,'MASTER CONTROLS'!$A$3:$D$11,4,FALSE),\"\")","v":""},null,null,null,null,null,null,null,1,"Sat"]
[null,null,null,null,null,null,null,null,{"$f":"IF(N5<>'MASTER CONTROLS'!G3,I22+1,\"\")","v":"2022-03-06"},null,null,{"$f":"IF($U23>1,VLOOKUP($U23,'MASTER CONTROLS'!$A$3:$D$11,3,FALSE),\"\")","v":""},{"$f":"IF($U23>1,VLOOKUP($U23,'MASTER CONTROLS'!$A$3:$D$11,4,FALSE),\"\")","v":""},null,null,null,null,null,null,null,1,"Sun"]
[null,null,null,null,null,null,null,null,{"$f":"IF(N5<>'MASTER CONTROLS'!G3,I23+1,\"\")","v":"2022-03-07"},null,null,{"$f":"IF($U24>1,VLOOKUP($U24,'MASTER CONTROLS'!$A$3:$D$11,3,FALSE),\"\")","v":""},{"$f":"IF($U24>1,VLOOKUP($U24,'MASTER CONTROLS'!$A$3:$D$11,4,FALSE),\"\")","v":""},null,null,null,null,null,null,null,1,"Mon"]
[null,null,null,null,null,null,null,null,{"$f":"IF(N5<>'MASTER CONTROLS'!G3,I24+1,\"\")","v":"2022-03-08"},null,null,{"$f":"IF($U25>1,VLOOKUP($U25,'MASTER CONTROLS'!$A$3:$D$11,3,FALSE),\"\")","v":""},{"$f":"IF($U25>1,VLOOKUP($U25,'MASTER CONTROLS'!$A$3:$D$11,4,FALSE),\"\")","v":""},null,null,null,null,null,null,null,1,"Tue"]
[null,null,null,null,null,null,null,null,{"$f":"IF(N5<>'MASTER CONTROLS'!G3,I25+1,\"\")","v":"2022-03-09"},null,null,{"$f":"IF($U26>1,VLOOKUP($U26,'MASTER CONTROLS'!$A$3:$D$11,3,FALSE),\"\")","v":""},{"$f":"IF($U26>1,VLOOKUP($U26,'MASTER CONTROLS'!$A$3:$D$11,4,FALSE),\"\")","v":""},null,null,null,null,null,null,null,1,"Wed"]
[null,null,null,null,null,null,null,null,{"$f":"IF(N5<>'MASTER CONTROLS'!G3,I26+1,\"\")","v":"2022-03-10"},null,null,{"$f":"IF($U27>1,VLOOKUP($U27,'MASTER CONTROLS'!$A$3:$D$11,3,FALSE),\"\")","v":""},{"$f":"IF($U27>1,VLOOKUP($U27,'MASTER CONTROLS'!$A$3:$D$11,4,FALSE),\"\")","v":""},null,null,null,null,null,null,null,1,"Thu"]
[null,null,null,null,null,null,null,null,{"$f":"IF(N5<>'MASTER CONTROLS'!G3,I27+1,\"\")","v":"2022-03-11"},null,null,{"$f":"IF($U28>1,VLOOKUP($U28,'MASTER CONTROLS'!$A$3:$D$11,3,FALSE),\"\")","v":""},{"$f":"IF($U28>1,VLOOKUP($U28,'MASTER CONTROLS'!$A$3:$D$11,4,FALSE),\"\")","v":""},null,null,null,null,null,null,null,1,"Fri"]
[null,null,null,null,null,null,null,null,{"$f":"IF(N5<>'MASTER CONTROLS'!G3,I28+1,\"\")","v":"2022-03-12"},null,null,{"$f":"IF($U29>1,VLOOKUP($U29,'MASTER CONTROLS'!$A$3:$D$11,3,FALSE),\"\")","v":""},{"$f":"IF($U29>1,VLOOKUP($U29,'MASTER CONTROLS'!$A$3:$D$11,4,FALSE),\"\")","v":""},null,null,null,null,null,null,null,1,"Sat"]
[null,null,null,null,null,null,null,null,{"$f":"IF(N5<>'MASTER CONTROLS'!G3,I29+1,\"\")","v":"2022-03-13"},null,null,{"$f":"IF($U30>1,VLOOKUP($U30,'MASTER CONTROLS'!$A$3:$D$11,3,FALSE),\"\")","v":""},{"$f":"IF($U30>1,VLOOKUP($U30,'MASTER CONTROLS'!$A$3:$D$11,4,FALSE),\"\")","v":""},null,null,null,null,null,null,null,1,"Sun"]
[null,null,null,null,null,null,null,null,{"$f":"IF(N5<>'MASTER CONTROLS'!G3,I30+1,\"\")","v":"2022-03-14"},null,null,{"$f":"IF($U31>1,VLOOKUP($U31,'MASTER CONTROLS'!$A$3:$D$11,3,FALSE),\"\")","v":""},{"$f":"IF($U31>1,VLOOKUP($U31,'MASTER CONTROLS'!$A$3:$D$11,4,FALSE),\"\")","v":""},null,null,null,null,null,null,null,1,"Mon"]
[null,null,null,null,null,null,null,null,{"$f":"IF(N5<>'MASTER CONTROLS'!G3,I31+1,\"\")","v":"2022-03-15"},null,null,{"$f":"IF($U32>1,VLOOKUP($U32,'MASTER CONTROLS'!$A$3:$D$11,3,FALSE),\"\")","v":""},{"$f":"IF($U32>1,VLOOKUP($U32,'MASTER CONTROLS'!$A$3:$D$11,4,FALSE),\"\")","v":""},null,null,null,null,null,null,null,1,"Tue"]
[null,null,null,null,null,null,null,null,{"$f":"IF(N5<>'MASTER CONTROLS'!G3,I32+1,\"\")","v":"2022-03-16"},null,null,{"$f":"IF($U33>1,VLOOKUP($U33,'MASTER CONTROLS'!$A$3:$D$11,3,FALSE),\"\")","v":""},{"$f":"IF($U33>1,VLOOKUP($U33,'MASTER CONTROLS'!$A$3:$D$11,4,FALSE),\"\")","v":""},null,null,null,null,null,null,null,1,"Wed"]
[null,null,null,null,null,null,null,null,{"$f":"IF(N5<>'MASTER CONTROLS'!G3,I33+1,\"\")","v":"2022-03-17"},null,null,{"$f":"IF($U34>1,VLOOKUP($U34,'MASTER CONTROLS'!$A$3:$D$11,3,FALSE),\"\")","v":""},{"$f":"IF($U34>1,VLOOKUP($U34,'MASTER CONTROLS'!$A$3:$D$11,4,FALSE),\"\")","v":""},null,null,null,null,null,null,null,1,"Thu"]
[null,null,null,null,null,null,null,null,{"$f":"IF(N5<>'MASTER CONTROLS'!G3,I34+1,\"\")","v":"2022-03-18"},null,null,{"$f":"IF($U35>1,VLOOKUP($U35,'MASTER CONTROLS'!$A$3:$D$11,3,FALSE),\"\")","v":""},{"$f":"IF($U35>1,VLOOKUP($U35,'MASTER CONTROLS'!$A$3:$D$11,4,FALSE),\"\")","v":""},null,null,null,null,null,null,null,1,"Fri"]
[null,null,null,null,null,null,null,null,{"$f":"IF(N5<>'MASTER CONTROLS'!G3,I35+1,\"\")","v":"2022-03-19"},null,null,{"$f":"IF($U36>1,VLOOKUP($U36,'MASTER CONTROLS'!$A$3:$D$11,3,FALSE),\"\")","v":""},{"$f":"IF($U36>1,VLOOKUP($U36,'MASTER CONTROLS'!$A$3:$D$11,4,FALSE),\"\")","v":""},null,null,null,null,null,null,null,1,"Sat"]
[null,null,null,null,null,null,null,null,{"$f":"IF(N5<>'MASTER CONTROLS'!G3,I36+1,\"\")","v":"2022-03-20"},null,null,{"$f":"IF($U37>1,VLOOKUP($U37,'MASTER CONTROLS'!$A$3:$D$11,3,FALSE),\"\")","v":""},{"$f":"IF($U37>1,VLOOKUP($U37,'MASTER CONTROLS'!$A$3:$D$11,4,FALSE),\"\")","v":""},null,null,null,null,null,null,null,1,"Sun"]
[null,null,null,null,null,null,null,null,{"$f":"IF(N5<>'MASTER CONTROLS'!G3,I37+1,\"\")","v":"2022-03-21"},null,null,{"$f":"IF($U38>1,VLOOKUP($U38,'MASTER CONTROLS'!$A$3:$D$11,3,FALSE),\"\")","v":""},{"$f":"IF($U38>1,VLOOKUP($U38,'MASTER CONTROLS'!$A$3:$D$11,4,FALSE),\"\")","v":""},null,null,null,null,null,null,null,1,"Mon"]
[null,null,null,null,null,null,null,null,{"$f":"IF(N5<>'MASTER CONTROLS'!G3,I38+1,\"\")","v":"2022-03-22"},null,null,{"$f":"IF($U39>1,VLOOKUP($U39,'MASTER CONTROLS'!$A$3:$D$11,3,FALSE),\"\")","v":""},{"$f":"IF($U39>1,VLOOKUP($U39,'MASTER CONTROLS'!$A$3:$D$11,4,FALSE),\"\")","v":""},null,null,null,null,null,null,null,1,"Tue"]
[null,null,null,null,null,null,null,null,{"$f":"IF(N5<>'MASTER CONTROLS'!G3,I39+1,\"\")","v":"2022-03-23"},null,null,{"$f":"IF($U40>1,VLOOKUP($U40,'MASTER CONTROLS'!$A$3:$D$11,3,FALSE),\"\")","v":""},{"$f":"IF($U40>1,VLOOKUP($U40,'MASTER CONTROLS'!$A$3:$D$11,4,FALSE),\"\")","v":""},null,null,null,null,null,null,null,1,"Wed"]
[null,null,null,null,null,null,null,null,{"$f":"IF(N5<>'MASTER CONTROLS'!G3,I40+1,\"\")","v":"2022-03-24"},null,null,{"$f":"IF($U41>1,VLOOKUP($U41,'MASTER CONTROLS'!$A$3:$D$11,3,FALSE),\"\")","v":""},{"$f":"IF($U41>1,VLOOKUP($U41,'MASTER CONTROLS'!$A$3:$D$11,4,FALSE),\"\")","v":""},null,null,null,null,null,null,null,1,"Thu"]
[null,null,null,null,null,null,null,null,{"$f":"IF(N5<>'MASTER CONTROLS'!G3,I41+1,\"\")","v":"2022-03-25"},null,null,{"$f":"IF($U42>1,VLOOKUP($U42,'MASTER CONTROLS'!$A$3:$D$11,3,FALSE),\"\")","v":""},{"$f":"IF($U42>1,VLOOKUP($U42,'MASTER CONTROLS'!$A$3:$D$11,4,FALSE),\"\")","v":""},null,null,null,null,null,null,null,1,"Fri"]
[null,null,null,null,null,null,null,null,{"$f":"IF(N5<>'MASTER CONTROLS'!G3,I42+1,\"\")","v":"2022-03-26"},null,null,{"$f":"IF($U43>1,VLOOKUP($U43,'MASTER CONTROLS'!$A$3:$D$11,3,FALSE),\"\")","v":""},{"$f":"IF($U43>1,VLOOKUP($U43,'MASTER CONTROLS'!$A$3:$D$11,4,FALSE),\"\")","v":""},null,null,null,null,null,null,null,1,"Sat"]
[null,null,null,null,null,null,null,null,{"$f":"IF(N5<>'MASTER CONTROLS'!G3,I43+1,\"\")","v":"2022-03-27"},null,null,{"$f":"IF($U44>1,VLOOKUP($U44,'MASTER CONTROLS'!$A$3:$D$11,3,FALSE),\"\")","v":""},{"$f":"IF($U44>1,VLOOKUP($U44,'MASTER CONTROLS'!$A$3:$D$11,4,FALSE),\"\")","v":""},null,null,null,null,null,null,null,1,"Sun"]
[null,null,null,null,null,null,null,null,{"$f":"IF(N5<>'MASTER CONTROLS'!G3,I44+1,\"\")","v":"2022-03-28"},null,null,{"$f":"IF($U45>1,VLOOKUP($U45,'MASTER CONTROLS'!$A$3:$D$11,3,FALSE),\"\")","v":""},{"$f":"IF($U45>1,VLOOKUP($U45,'MASTER CONTROLS'!$A$3:$D$11,4,FALSE),\"\")","v":""},null,null,null,null,null,null,null,1,"Mon"]
[null,null,null,null,null,null,null,null,{"$f":"IF(N6<>'MASTER CONTROLS'!G4,I45+1,\"\")","v":"2022-03-29"},null,null,{"$f":"IF($U46>1,VLOOKUP($U46,'MASTER CONTROLS'!$A$3:$D$11,3,FALSE),\"\")","v":""},{"$f":"IF($U46>1,VLOOKUP($U46,'MASTER CONTROLS'!$A$3:$D$11,4,FALSE),\"\")","v":""},null,null,null,null,null,null,null,1,"Tue"]
[null,null,null,null,null,null,null,null,{"$f":"IF(N7<>'MASTER CONTROLS'!G5,I46+1,\"\")","v":"2022-03-30"},null,null,{"$f":"IF($U47>1,VLOOKUP($U47,'MASTER CONTROLS'!$A$3:$D$11,3,FALSE),\"\")","v":""},{"$f":"IF($U47>1,VLOOKUP($U47,'MASTER CONTROLS'!$A$3:$D$11,4,FALSE),\"\")","v":""},null,null,null,null,null,null,null,1,"Wed"]
[null,null,null,null,null,null,null,null,{"$f":"IF(N8<>'MASTER CONTROLS'!G6,I47+1,\"\")","v":"2022-03-31"},null,null,{"$f":"IF($U48>1,VLOOKUP($U48,'MASTER CONTROLS'!$A$3:$D$11,3,FALSE),\"\")","v":""},{"$f":"IF($U48>1,VLOOKUP($U48,'MASTER CONTROLS'!$A$3:$D$11,4,FALSE),\"\")","v":""},null,null,null,null,null,null,null,1,"Thu"]
["TOTALS",null,null,null,null,null,{"$f":"SUM(G18:H48)","v":0},null,null,null,{"$f":"SUM(K18:K48)","v":0},0,0,0,0,0]
[]
["Office Staff Section",null,null,null,null,null,null,null,null,null,null,null,null,"Phone","Internet","Total"]
[null,null,null,null,null,null,null,null,null,null,null,null,null,null,null,{"$f":"SUM(N52:O52)","v":0}]
[]
["Pastor's Section",null,null,null,null,null,null,null,{"$f":"Jan!I54","v":"Profession of Faith"},null,null,"Worship Service Attendance"]
[{"$f":"Jan!A55","v":"Church Name "},null,null,null,null,null,null,"Baptisms",null,null,"Transfers","Week 1","Week 2","Week 3","Week 4","Week 5"]
[null,null,null,null,null,null,null,null,null,null,null,null,null,null,null,null,{"$f":"COUNTIF(V18:V48,\"Sat\")","v":4},{"$f":"COUNT(G56:P56)","v":0}]
[]
[]
[]
[]
["Comments & Notes"]
[]
[null,null,null,null,null,null,null,null,null,null,null,null,null,null,null,null,null,null,null,null,false]
[]
["OFFICE USE ONLY"]
["10200) Travel Budget",null,null,null,null,null,"10201) Per Diem Tx",null,null,null,null,null,"11206) Travel Misc"]
["11211) Non-Tax Miles",null,null,null,null,null,"11201) Per Diem NTx",null,null,null,null,null,"11230) Conv./Mtgs"]
["11200) Special Miles",null,null,null,null,null,"11202) Lodging",null,null,null,null,null,"11403) Phone"]
["10212) Spouse Travel",null,null,null,null,null,"11203) Car Rental",null,null,null,null,null,"10408) Internet"]
["11405) Entertainment",null,null,null,null,null,"11209) Airfare Travel"]

{"sheet":"Apr","index":4,"n_rows":70,"n_cols":22,"rows_kept":70,"cut":false,"hidden":false,"merged":[[19,6,19,7],[18,6,18,7],[17,6,17,7],[10,6,10,7],[29,6,29,7],[28,6,28,7],[27,6,27,7],[26,6,26,7],[25,6,25,7],[24,6,24,7],[23,6,23,7],[22,6,22,7],[21,6,21,7],[44,6,44,7],[43,6,43,7],[42,6,42,7],[41,6,41,7],[40,6,40,7],[67,0,67,2],[69,0,69,1],[69,6,69,7],[20,6,20,7],[38,6,38,7],[37,6,37,7],[36,6,36,7],[35,6,35,7],[34,6,34,7],[33,6,33,7],[32,6,32,7],[39,8,39,9],[46,8,46,9],[26,8,26,9],[31,1,31,5],[32,1,32,5],[34,8,34,9],[33,8,33,9],[30,8,30,9],[38,8,38,9],[42,8,42,9],[44,1,44,5],[43,1,43,5],[34,1,34,5],[36,1,36,5],[35,1,35,5],[39,1,39,5],[40,1,40,5],[36,8,36,9],[37,8,37,9],[41,8,41,9],[29,8,29,9],[31,6,31,7],[30,6,30,7],[46,6,46,7],[69,12,69,13],[68,14,68,15],[65,14,65,15],[66,14,66,15],[67,14,67,15],[65,12,65,13],[0,0,0,15],[37,1,37,5],[38,1,38,5],[9,1,9,5],[10,1,10,5],[17,1,17,5],[9,14,10,15],[9,6,9,7],[35,8,35,9],[1,0,1,15],[8,10,8,12],[3,1,3,9],[7,5,7,10],[4,1,4,9],[5,1,5,9],[19,1,19,5],[19,8,19,9],[8,0,8,9],[68,12,68,13],[66,0,66,2],[67,6,67,8],[68,6,68,8],[47,1,47,5],[59,0,59,2],[68,3,68,4],[68,0,68,2],[55,0,55,6],[56,0,56,6],[59,6,59,8],[57,0,57,6],[64,0,64,15],[66,6,66,8],[59,9,59,10],[50,0,50,2],[54,0,54,5],[60,2,61,15],[59,11,59,12],[47,8,47,9],[56,8,56,9],[55,8,55,9],[48,6,48,7],[47,6,47,7],[18,8,18,9],[3,16,3,19],[4,16,6,19],[7,16,7,19],[6,0,6,9],[7,1,7,3],[9,11,9,12],[4,13,4,15],[5,13,5,15],[6,13,8,15],[18,1,18,5],[9,8,10,9],[17,8,17,9],[21,8,21,9],[40,8,40,9],[31,8,31,9],[32,8,32,9],[20,8,20,9],[24,8,24,9],[25,1,25,5],[22,1,22,5],[27,8,27,9],[23,8,23,9],[21,1,21,5],[25,8,25,9],[22,8,22,9],[20,1,20,5],[24,1,24,5],[27,1,27,5],[23,1,23,5],[29,1,29,5],[30,1,30,5],[28,1,28,5],[28,8,28,9],[33,1,33,5],[26,1,26,5],[39,6,39,7],[45,1,45,5],[48,0,48,5],[67,12,67,13],[66,12,66,13],[41,1,41,5],[46,1,46,5],[65,3,65,4],[65,0,65,2],[65,6,65,8],[66,3,66,4],[53,0,53,1],[48,8,48,9],[53,8,54,9],[51,0,51,12],[53,11,53,15],[67,3,67,4],[42,1,42,5],[60,0,61,1],[59,13,59,14],[57,8,57,9],[44,8,44,9],[43,8,43,9],[45,8,45,9],[45,6,45,7]]}
[{"$f":"\"Northern California Conference Expense Report\" & IF($U$63=TRUE,\" (REVISED)\",\"\")","v":"Northern California Conference Expense Report"}]
[{"$f":"Jan!A2","v":"Email to: payroll@nccsda.com      "},null,null,null,null,null,null,null,null,null,null,null,null,null,null,null,null,null,null,null,false]
[]
["Name",{"$f":"IF(Mar!B4<>\"\",Mar!B4,\"\")","v":""},null,null,{"$f":"IF(Jan!E4<>\"\",Jan!E4,\"\")","v":""},null,null,{"$f":"IF(Jan!H4<>\"\",Jan!H4,\"\")","v":""},null,null,null,null,null,null,null,null,"Per Diem Note:"]
["Address",{"$f":"IF(Mar!B5<>\"\",Mar!B5,\"\")","v":""},null,null,{"$f":"IF(Jan!E5<>\"\",Jan!E5,\"\")","v":""},null,null,{"$f":"IF(Jan!H5<>\"\",Jan!H5,\"\")","v":""},null,null,null,null,null,{"$f":"'MASTER CONTROLS'!G7","v":"2022-04-01"},null,null,"1) If you are away from home and have an overnight stay on either side of a day you qualify for per diem, choose an option with NT."]
[null,{"$f":"IF(Mar!B6<>\"\",Mar!B6,\"\")","v":""},null,null,{"$f":"IF(Jan!E6<>\"\",Jan!E6,\"\")","v":""},null,null,{"$f":"IF(Jan!H6<>\"\",Jan!H6,\"\")","v":""},null,null,null,null,null,{"$f":" IF(N5<>'MASTER CONTROLS'!G3,\"Due \" & TEXT(DATE(1,MONTH(I18)+1,1),\"mmmm\") & \" 3rd.\",\"\")","v":"Due May 3rd."}]
["Best way to contact:",null,null,null,null,null,null,null,null,null,null,null,null,"*Reimbursements are made for completed reports including original receipts with travel approval from ADCO or assigned job duties. Lodging must be documented with a folio."]
["Phone:",{"$f":"IF(Mar!B8<>\"\",Mar!B8,\"\")","v":""},null,null,"Email:",{"$f":"IF(Mar!F8<>\"\",Mar!F8,\"\")","v":""},null,null,{"$f":"IF(Jan!I8<>\"\",Jan!I8,\"\")","v":""},null,null,null,null,null,null,null,{"$f":"Jan!Q8","v":"2) Per diem for events that do not include an overnight stay are taxable. Spousal per diems are always taxable."}]
[{"$f":"Jan!A9","v":"Please log in to APS Employee online to update your address and phone number."},null,null,null,null,null,null,null,null,null,"** ADCO must approve Special Mileage."]
["Short","Daily Activity Description",null,null,null,null,null,null,"Date",null,"Special","Per Diem",null,null,"Air/Car/Gas/Transit    Other",null,null,"PD Tx","PD NTx","Per Diem","Ans: Per"]
["Description","Example: Visitation, Sermon Prep, etc.",null,null,null,null,"Budgeted Mileage",null,null,null,"Mileage**","Taxable","Non-Tax","Lodging*",null,null,null,{"$f":"$L$49","v":0},{"$f":"$M$49","v":0},"Totals","Diem"]
[]
["Worked"]
["Day Off"]
["Vacation"]
["Sick Day"]
["Holiday"]
[null,null,null,null,null,null,null,null,{"$f":"IF(N5<>'MASTER CONTROLS'!G3,N5,\"\")","v":"2022-04-01"},null,null,{"$f":"IF($U18>1,VLOOKUP($U18,'MASTER CONTROLS'!$A$3:$D$11,3,FALSE),\"\")","v":""},{"$f":"IF($U18>1,VLOOKUP($U18,'MASTER CONTROLS'!$A$3:$D$11,4,FALSE),\"\")","v":""},null,null,null,null,null,null,null,1,{"$f":"TEXT(I18,\"ddd\")","v":"Fri"}]
[null,null,null,null,null,null,null,null,{"$f":"IF(N5<>'MASTER CONTROLS'!G3,I18+1,\"\")","v":"2022-04-02"},null,null,{"$f":"IF($U19>1,VLOOKUP($U19,'MASTER CONTROLS'!$A$3:$D$11,3,FALSE),\"\")","v":""},{"$f":"IF($U19>1,VLOOKUP($U19,'MASTER CONTROLS'!$A$3:$D$11,4,FALSE),\"\")","v":""},null,null,null,null,null,null,null,1,"Sat"]
[null,null,null,null,null,null,null,null,{"$f":"IF(N5<>'MASTER CONTROLS'!G3,I19+1,\"\")","v":"2022-04-03"},null,null,{"$f":"IF($U20>1,VLOOKUP($U20,'MASTER CONTROLS'!$A$3:$D$11,3,FALSE),\"\")","v":""},{"$f":"IF($U20>1,VLOOKUP($U20,'MASTER CONTROLS'!$A$3:$D$11,4,FALSE),\"\")","v":""},null,null,null,null,null,null,null,1,"Sun"]
[null,null,null,null,null,null,null,null,{"$f":"IF(N5<>'MASTER CONTROLS'!G3,I20+1,\"\")","v":"2022-04-04"},null,null,{"$f":"IF($U21>1,VLOOKUP($U21,'MASTER CONTROLS'!$A$3:$D$11,3,FALSE),\"\")","v":""},{"$f":"IF($U21>1,VLOOKUP($U21,'MASTER CONTROLS'!$A$3:$D$11,4,FALSE),\"\")","v":""},null,null,null,null,null,null,null,1,"Mon"]
[null,null,null,null,null,null,null,null,{"$f":"IF(N5<>'MASTER CONTROLS'!G3,I21+1,\"\")","v":"2022-04-05"},null,null,{"$f":"IF($U22>1,VLOOKUP($U22,'MASTER CONTROLS'!$A$3:$D$11,3,FALSE),\"\")","v":""},{"$f":"IF($U22>1,VLOOKUP($U22,'MASTER CONTROLS'!$A$3:$D$11,4,FALSE),\"\")","v":""},null,null,null,null,null,null,null,1,"Tue"]
[null,null,null,null,null,null,null,null,{"$f":"IF(N5<>'MASTER CONTROLS'!G3,I22+1,\"\")","v":"2022-04-06"},null,null,{"$f":"IF($U23>1,VLOOKUP($U23,'MASTER CONTROLS'!$A$3:$D$11,3,FALSE),\"\")","v":""},{"$f":"IF($U23>1,VLOOKUP($U23,'MASTER CONTROLS'!$A$3:$D$11,4,FALSE),\"\")","v":""},null,null,null,null,null,null,null,1,"Wed"]
[null,null,null,null,null,null,null,null,{"$f":"IF(N5<>'MASTER CONTROLS'!G3,I23+1,\"\")","v":"2022-04-07"},null,null,{"$f":"IF($U24>1,VLOOKUP($U24,'MASTER CONTROLS'!$A$3:$D$11,3,FALSE),\"\")","v":""},{"$f":"IF($U24>1,VLOOKUP($U24,'MASTER CONTROLS'!$A$3:$D$11,4,FALSE),\"\")","v":""},null,null,null,null,null,null,null,1,"Thu"]
[null,null,null,null,null,null,null,null,{"$f":"IF(N5<>'MASTER CONTROLS'!G3,I24+1,\"\")","v":"2022-04-08"},null,null,{"$f":"IF($U25>1,VLOOKUP($U25,'MASTER CONTROLS'!$A$3:$D$11,3,FALSE),\"\")","v":""},{"$f":"IF($U25>1,VLOOKUP($U25,'MASTER CONTROLS'!$A$3:$D$11,4,FALSE),\"\")","v":""},null,null,null,null,null,null,null,1,"Fri"]
[null,null,null,null,null,null,null,null,{"$f":"IF(N5<>'MASTER CONTROLS'!G3,I25+1,\"\")","v":"2022-04-09"},null,null,{"$f":"IF($U26>1,VLOOKUP($U26,'MASTER CONTROLS'!$A$3:$D$11,3,FALSE),\"\")","v":""},{"$f":"IF($U26>1,VLOOKUP($U26,'MASTER CONTROLS'!$A$3:$D$11,4,FALSE),\"\")","v":""},null,null,null,null,null,null,null,1,"Sat"]
[null,null,null,null,null,null,null,null,{"$f":"IF(N5<>'MASTER CONTROLS'!G3,I26+1,\"\")","v":"2022-04-10"},null,null,{"$f":"IF($U27>1,VLOOKUP($U27,'MASTER CONTROLS'!$A$3:$D$11,3,FALSE),\"\")","v":""},{"$f":"IF($U27>1,VLOOKUP($U27,'MASTER CONTROLS'!$A$3:$D$11,4,FALSE),\"\")","v":""},null,null,null,null,null,null,null,1,"Sun"]
[null,null,null,null,null,null,null,null,{"$f":"IF(N5<>'MASTER CONTROLS'!G3,I27+1,\"\")","v":"2022-04-11"},null,null,{"$f":"IF($U28>1,VLOOKUP($U28,'MASTER CONTROLS'!$A$3:$D$11,3,FALSE),\"\")","v":""},{"$f":"IF($U28>1,VLOOKUP($U28,'MASTER CONTROLS'!$A$3:$D$11,4,FALSE),\"\")","v":""},null,null,null,null,null,null,null,1,"Mon"]
[null,null,null,null,null,null,null,null,{"$f":"IF(N5<>'MASTER CONTROLS'!G3,I28+1,\"\")","v":"2022-04-12"},null,null,{"$f":"IF($U29>1,VLOOKUP($U29,'MASTER CONTROLS'!$A$3:$D$11,3,FALSE),\"\")","v":""},{"$f":"IF($U29>1,VLOOKUP($U29,'MASTER CONTROLS'!$A$3:$D$11,4,FALSE),\"\")","v":""},null,null,null,null,null,null,null,1,"Tue"]
[null,null,null,null,null,null,null,null,{"$f":"IF(N5<>'MASTER CONTROLS'!G3,I29+1,\"\")","v":"2022-04-13"},null,null,{"$f":"IF($U30>1,VLOOKUP($U30,'MASTER CONTROLS'!$A$3:$D$11,3,FALSE),\"\")","v":""},{"$f":"IF($U30>1,VLOOKUP($U30,'MASTER CONTROLS'!$A$3:$D$11,4,FALSE),\"\")","v":""},null,null,null,null,null,null,null,1,"Wed"]
[null,null,null,null,null,null,null,null,{"$f":"IF(N5<>'MASTER CONTROLS'!G3,I30+1,\"\")","v":"2022-04-14"},null,null,{"$f":"IF($U31>1,VLOOKUP($U31,'MASTER CONTROLS'!$A$3:$D$11,3,FALSE),\"\")","v":""},{"$f":"IF($U31>1,VLOOKUP($U31,'MASTER CONTROLS'!$A$3:$D$11,4,FALSE),\"\")","v":""},null,null,null,null,null,null,null,1,"Thu"]
[null,null,null,null,null,null,null,null,{"$f":"IF(N5<>'MASTER CONTROLS'!G3,I31+1,\"\")","v":"2022-04-15"},null,null,{"$f":"IF($U32>1,VLOOKUP($U32,'MASTER CONTROLS'!$A$3:$D$11,3,FALSE),\"\")","v":""},{"$f":"IF($U32>1,VLOOKUP($U32,'MASTER CONTROLS'!$A$3:$D$11,4,FALSE),\"\")","v":""},null,null,null,null,null,null,null,1,"Fri"]
[null,null,null,null,null,null,null,null,{"$f":"IF(N5<>'MASTER CONTROLS'!G3,I32+1,\"\")","v":"2022-04-16"},null,null,{"$f":"IF($U33>1,VLOOKUP($U33,'MASTER CONTROLS'!$A$3:$D$11,3,FALSE),\"\")","v":""},{"$f":"IF($U33>1,VLOOKUP($U33,'MASTER CONTROLS'!$A$3:$D$11,4,FALSE),\"\")","v":""},null,null,null,null,null,null,null,1,"Sat"]
[null,null,null,null,null,null,null,null,{"$f":"IF(N5<>'MASTER CONTROLS'!G3,I33+1,\"\")","v":"2022-04-17"},null,null,{"$f":"IF($U34>1,VLOOKUP($U34,'MASTER CONTROLS'!$A$3:$D$11,3,FALSE),\"\")","v":""},{"$f":"IF($U34>1,VLOOKUP($U34,'MASTER CONTROLS'!$A$3:$D$11,4,FALSE),\"\")","v":""},null,null,null,null,null,null,null,1,"Sun"]
[null,null,null,null,null,null,null,null,{"$f":"IF(N5<>'MASTER CONTROLS'!G3,I34+1,\"\")","v":"2022-04-18"},null,null,{"$f":"IF($U35>1,VLOOKUP($U35,'MASTER CONTROLS'!$A$3:$D$11,3,FALSE),\"\")","v":""},{"$f":"IF($U35>1,VLOOKUP($U35,'MASTER CONTROLS'!$A$3:$D$11,4,FALSE),\"\")","v":""},null,null,null,null,null,null,null,1,"Mon"]
[null,null,null,null,null,null,null,null,{"$f":"IF(N5<>'MASTER CONTROLS'!G3,I35+1,\"\")","v":"2022-04-19"},null,null,{"$f":"IF($U36>1,VLOOKUP($U36,'MASTER CONTROLS'!$A$3:$D$11,3,FALSE),\"\")","v":""},{"$f":"IF($U36>1,VLOOKUP($U36,'MASTER CONTROLS'!$A$3:$D$11,4,FALSE),\"\")","v":""},null,null,null,null,null,null,null,1,"Tue"]
[null,null,null,null,null,null,null,null,{"$f":"IF(N5<>'MASTER CONTROLS'!G3,I36+1,\"\")","v":"2022-04-20"},null,null,{"$f":"IF($U37>1,VLOOKUP($U37,'MASTER CONTROLS'!$A$3:$D$11,3,FALSE),\"\")","v":""},{"$f":"IF($U37>1,VLOOKUP($U37,'MASTER CONTROLS'!$A$3:$D$11,4,FALSE),\"\")","v":""},null,null,null,null,null,null,null,1,"Wed"]
[null,null,null,null,null,null,null,null,{"$f":"IF(N5<>'MASTER CONTROLS'!G3,I37+1,\"\")","v":"2022-04-21"},null,null,{"$f":"IF($U38>1,VLOOKUP($U38,'MASTER CONTROLS'!$A$3:$D$11,3,FALSE),\"\")","v":""},{"$f":"IF($U38>1,VLOOKUP($U38,'MASTER CONTROLS'!$A$3:$D$11,4,FALSE),\"\")","v":""},null,null,null,null,null,null,null,1,"Thu"]
[null,null,null,null,null,null,null,null,{"$f":"IF(N6<>'MASTER CONTROLS'!G4,I38+1,\"\")","v":"2022-04-22"},null,null,{"$f":"IF($U39>1,VLOOKUP($U39,'MASTER CONTROLS'!$A$3:$D$11,3,FALSE),\"\")","v":""},{"$f":"IF($U39>1,VLOOKUP($U39,'MASTER CONTROLS'!$A$3:$D$11,4,FALSE),\"\")","v":""},null,null,null,null,null,null,null,1,"Fri"]
[null,null,null,null,null,null,null,null,{"$f":"IF(N7<>'MASTER CONTROLS'!G5,I39+1,\"\")","v":"2022-04-23"},null,null,{"$f":"IF($U40>1,VLOOKUP($U40,'MASTER CONTROLS'!$A$3:$D$11,3,FALSE),\"\")","v":""},{"$f":"IF($U40>1,VLOOKUP($U40,'MASTER CONTROLS'!$A$3:$D$11,4,FALSE),\"\")","v":""},null,null,null,null,null,null,null,1,"Sat"]
[null,null,null,null,null,null,null,null,{"$f":"IF(N8<>'MASTER CONTROLS'!G6,I40+1,\"\")","v":"2022-04-24"},null,null,{"$f":"IF($U41>1,VLOOKUP($U41,'MASTER CONTROLS'!$A$3:$D$11,3,FALSE),\"\")","v":""},{"$f":"IF($U41>1,VLOOKUP($U41,'MASTER CONTROLS'!$A$3:$D$11,4,FALSE),\"\")","v":""},null,null,null,null,null,null,null,1,"Sun"]
[null,null,null,null,null,null,null,null,{"$f":"IF(N9<>'MASTER CONTROLS'!G7,I41+1,\"\")","v":"2022-04-25"},null,null,{"$f":"IF($U42>1,VLOOKUP($U42,'MASTER CONTROLS'!$A$3:$D$11,3,FALSE),\"\")","v":""},{"$f":"IF($U42>1,VLOOKUP($U42,'MASTER CONTROLS'!$A$3:$D$11,4,FALSE),\"\")","v":""},null,null,null,null,null,null,null,1,"Mon"]
[null,null,null,null,null,null,null,null,{"$f":"IF(N10<>'MASTER CONTROLS'!G8,I42+1,\"\")","v":"2022-04-26"},null,null,{"$f":"IF($U43>1,VLOOKUP($U43,'MASTER CONTROLS'!$A$3:$D$11,3,FALSE),\"\")","v":""},{"$f":"IF($U43>1,VLOOKUP($U43,'MASTER CONTROLS'!$A$3:$D$11,4,FALSE),\"\")","v":""},null,null,null,null,null,null,null,1,"Tue"]
[null,null,null,null,null,null,null,null,{"$f":"IF(N11<>'MASTER CONTROLS'!G9,I43+1,\"\")","v":"2022-04-27"},null,null,{"$f":"IF($U44>1,VLOOKUP($U44,'MASTER CONTROLS'!$A$3:$D$11,3,FALSE),\"\")","v":""},{"$f":"IF($U44>1,VLOOKUP($U44,'MASTER CONTROLS'!$A$3:$D$11,4,FALSE),\"\")","v":""},null,null,null,null,null,null,null,1,"Wed"]
[null,null,null,null,null,null,null,null,{"$f":"IF(N12<>'MASTER CONTROLS'!G10,I44+1,\"\")","v":"2022-04-28"},null,null,{"$f":"IF($U45>1,VLOOKUP($U45,'MASTER CONTROLS'!$A$3:$D$11,3,FALSE),\"\")","v":""},{"$f":"IF($U45>1,VLOOKUP($U45,'MASTER CONTROLS'!$A$3:$D$11,4,FALSE),\"\")","v":""},null,null,null,null,null,null,null,1,"Thu"]
[null,null,null,null,null,null,null,null,{"$f":"IF(N13<>'MASTER CONTROLS'!G11,I45+1,\"\")","v":"2022-04-29"},null,null,{"$f":"IF($U46>1,VLOOKUP($U46,'MASTER CONTROLS'!$A$3:$D$11,3,FALSE),\"\")","v":""},{"$f":"IF($U46>1,VLOOKUP($U46,'MASTER CONTROLS'!$A$3:$D$11,4,FALSE),\"\")","v":""},null,null,null,null,null,null,null,1,"Fri"]
[null,null,null,null,null,null,null,null,{"$f":"IF(N14<>'MASTER CONTROLS'!G12,I46+1,\"\")","v":"2022-04-30"},null,null,{"$f":"IF($U47>1,VLOOKUP($U47,'MASTER CONTROLS'!$A$3:$D$11,3,FALSE),\"\")","v":""},{"$f":"IF($U47>1,VLOOKUP($U47,'MASTER CONTROLS'!$A$3:$D$11,4,FALSE),\"\")","v":""},null,null,null,null,null,null,null,1,"Sat"]
[null,null,null,null,null,null,null,null,null,null,null,{"$f":"IF($U48>1,VLOOKUP($U48,'MASTER CONTROLS'!$A$3:$D$11,3,FALSE),\"\")","v":""},{"$f":"IF($U48>1,VLOOKUP($U48,'MASTER CONTROLS'!$A$3:$D$11,4,FALSE),\"\")","v":""},null,null,null,null,null,null,null,1,"Sat"]
["TOTALS",null,null,null,null,null,{"$f":"SUM(G18:H48)","v":0},null,null,null,{"$f":"SUM(K18:K48)","v":0},0,0,0,0,0]
[]
["Office Staff Section",null,null,null,null,null,null,null,null,null,null,null,null,"Phone","Internet","Total"]
[null,null,null,null,null,null,null,null,null,null,null,null,null,null,null,{"$f":"SUM(N52:O52)","v":0}]
[]
["Pastor's Section",null,null,null,null,null,null,null,{"$f":"Jan!I54","v":"Profession of Faith"},null,null,"Worship Service Attendance"]
[{"$f":"Jan!A55","v":"Church Name "},null,null,null,null,null,null,"Baptisms",null,null,"Transfers","Week 1","Week 2","Week 3","Week 4","Week 5"]
[null,null,null,null,null,null,null,null,null,null,null,null,null,null,null,null,{"$f":"COUNTIF(V18:V48,\"Sat\")","v":6},{"$f":"COUNT(G56:P56)","v":0}]
[]
[]
[]
[]
["Comments & Notes"]
[]
[null,null,null,null,null,null,null,null,null,null,null,null,null,null,null,null,null,null,null,null,false]
[]
["OFFICE USE ONLY"]
["10200) Travel Budget",null,null,null,null,null,"10201) Per Diem Tx",null,null,null,null,null,"11206) Travel Misc"]
["11211) Non-Tax Miles",null,null,null,null,null,"11201) Per Diem NTx",null,null,null,null,null,"11230) Conv./Mtgs"]
["11200) Special Miles",null,null,null,null,null,"11202) Lodging",null,null,null,null,null,"11403) Phone"]
["10212) Spouse Travel",null,null,null,null,null,"11203) Car Rental",null,null,null,null,null,"10408) Internet"]
["11405) Entertainment",null,null,null,null,null,"11209) Airfare Travel"]

{"sheet":"May","index":5,"n_rows":70,"n_cols":22,"rows_kept":70,"cut":false,"hidden":false,"merged":[[69,0,69,1],[69,6,69,7],[21,6,21,7],[20,6,20,7],[19,6,19,7],[18,6,18,7],[17,6,17,7],[10,6,10,7],[30,6,30,7],[29,6,29,7],[28,6,28,7],[27,6,27,7],[26,6,26,7],[25,6,25,7],[24,6,24,7],[23,6,23,7],[22,6,22,7],[46,6,46,7],[45,6,45,7],[44,6,44,7],[43,6,43,7],[42,6,42,7],[41,6,41,7],[18,1,18,5],[4,13,4,15],[5,13,5,15],[6,13,8,15],[8,0,8,9],[8,10,8,12],[3,1,3,9],[7,5,7,10],[4,1,4,9],[5,1,5,9],[17,1,17,5],[9,14,10,15],[17,8,17,9],[3,16,3,19],[4,16,6,19],[7,16,7,19],[6,0,6,9],[7,1,7,3],[9,11,9,12],[9,8,10,9],[69,12,69,13],[41,1,41,5],[46,1,46,5],[47,1,47,5],[42,1,42,5],[44,1,44,5],[67,6,67,8],[64,0,64,15],[66,3,66,4],[67,3,67,4],[68,12,68,13],[66,0,66,2],[67,12,67,13],[66,12,66,13],[44,8,44,9],[68,14,68,15],[59,0,59,2],[68,3,68,4],[47,8,47,9],[56,8,56,9],[59,6,59,8],[57,0,57,6],[65,6,65,8],[65,14,65,15],[0,0,0,15],[37,1,37,5],[38,1,38,5],[9,1,9,5],[10,1,10,5],[9,6,9,7],[36,1,36,5],[35,1,35,5],[19,8,19,9],[21,8,21,9],[22,1,22,5],[24,1,24,5],[26,1,26,5],[25,1,25,5],[28,1,28,5],[31,1,31,5],[32,1,32,5],[31,8,31,9],[32,8,32,9],[20,8,20,9],[22,8,22,9],[24,8,24,9],[18,8,18,9],[1,0,1,15],[19,1,19,5],[20,1,20,5],[21,1,21,5],[36,8,36,9],[25,8,25,9],[29,1,29,5],[30,1,30,5],[37,8,37,9],[35,8,35,9],[26,8,26,9],[23,8,23,9],[28,8,28,9],[27,1,27,5],[23,1,23,5],[27,8,27,9],[30,8,30,9],[37,6,37,7],[36,6,36,7],[35,6,35,7],[34,6,34,7],[33,6,33,7],[32,6,32,7],[31,6,31,7],[29,8,29,9],[39,8,39,9],[40,1,40,5],[43,1,43,5],[34,1,34,5],[33,8,33,9],[38,8,38,9],[40,8,40,9],[33,1,33,5],[43,8,43,9],[34,8,34,9],[42,8,42,9],[41,8,41,9],[39,1,39,5],[40,6,40,7],[39,6,39,7],[38,6,38,7],[47,6,47,7],[46,8,46,9],[66,6,66,8],[45,8,45,9],[60,0,61,1],[54,0,54,5],[45,1,45,5],[55,8,55,9],[57,8,57,9],[68,0,68,2],[53,0,53,1],[48,8,48,9],[53,8,54,9],[51,0,51,12],[50,0,50,2],[53,11,53,15],[65,12,65,13],[59,9,59,10],[68,6,68,8],[60,2,61,15],[59,11,59,12],[66,14,66,15],[67,14,67,15],[65,0,65,2],[59,13,59,14],[48,0,48,5],[65,3,65,4],[55,0,55,6],[56,0,56,6],[48,6,48,7],[67,0,67,2]]}
[{"$f":"\"Northern California Conference Expense Report\" & IF($U$63=TRUE,\" (REVISED)\",\"\")","v":"Northern California Conference Expense Report"}]
[{"$f":"Jan!A2","v":"Email to: payroll@nccsda.com      "},null,null,null,null,null,null,null,null,null,null,null,null,null,null,null,null,null,null,null,false]
[]
["Name",{"$f":"IF(Apr!B4<>\"\",Apr!B4,\"\")","v":""},null,null,{"$f":"IF(Jan!E4<>\"\",Jan!E4,\"\")","v":""},null,null,{"$f":"IF(Jan!H4<>\"\",Jan!H4,\"\")","v":""},null,null,null,null,null,null,null,null,"Per Diem Note:"]
["Address",{"$f":"IF(Apr!B5<>\"\",Apr!B5,\"\")","v":""},null,null,{"$f":"IF(Jan!E5<>\"\",Jan!E5,\"\")","v":""},null,null,{"$f":"IF(Jan!H5<>\"\",Jan!H5,\"\")","v":""},null,null,null,null,null,{"$f":"'MASTER CONTROLS'!G8","v":"2022-05-01"},null,null,"1) If you are away from home and have an overnight stay on either side of a day you qualify for per diem, choose an option with NT."]
[null,{"$f":"IF(Apr!B6<>\"\",Apr!B6,\"\")","v":""},null,null,{"$f":"IF(Jan!E6<>\"\",Jan!E6,\"\")","v":""},null,null,{"$f":"IF(Jan!H6<>\"\",Jan!H6,\"\")","v":""},null,null,null,null,null,{"$f":" IF(N5<>'MASTER CONTROLS'!G3,\"Due \" & TEXT(DATE(1,MONTH(I18)+1,1),\"mmmm\") & \" 3rd.\",\"\")","v":"Due June 3rd."}]
["Best way to contact:",null,null,null,null,null,null,null,null,null,null,null,null,"*Reimbursements are made for completed reports including original receipts with travel approval from ADCO or assigned job duties. Lodging must be documented with a folio."]
["Phone:",{"$f":"IF(Apr!B8<>\"\",Apr!B8,\"\")","v":""},null,null,"Email:",{"$f":"IF(Apr!F8<>\"\",Apr!F8,\"\")","v":""},null,null,{"$f":"IF(Jan!I8<>\"\",Jan!I8,\"\")","v":""},null,null,null,null,null,null,null,{"$f":"Jan!Q8","v":"2) Per diem for events that do not include an overnight stay are taxable. Spousal per diems are always taxable."}]
[{"$f":"Jan!A9","v":"Please log in to APS Employee online to update your address and phone number."},null,null,null,null,null,null,null,null,null,"** ADCO must approve Special Mileage."]
["Short","Daily Activity Description",null,null,null,null,null,null,"Date",null,"Special","Per Diem",null,null,"Air/Car/Gas/Transit    Other",null,null,"PD Tx","PD NTx","Per Diem","Ans: Per"]
["Description","Example: Visitation, Sermon Prep, etc.",null,null,null,null,"Budgeted Mileage",null,null,null,"Mileage**","Taxable","Non-Tax","Lodging*",null,null,null,{"$f":"$L$49","v":0},{"$f":"$M$49","v":0},"Totals","Diem"]
[]
["Worked"]
["Day Off"]
["Vacation"]
["Sick Day"]
["Holiday"]
[null,null,null,null,null,null,null,null,{"$f":"IF(N5<>'MASTER CONTROLS'!G3,N5,\"\")","v":"2022-05-01"},null,null,{"$f":"IF($U18>1,VLOOKUP($U18,'MASTER CONTROLS'!$A$3:$D$11,3,FALSE),\"\")","v":""},{"$f":"IF($U18>1,VLOOKUP($U18,'MASTER CONTROLS'!$A$3:$D$11,4,FALSE),\"\")","v":""},null,null,null,null,null,null,null,1,{"$f":"TEXT(I18,\"ddd\")","v":"Sun"}]
[null,null,null,null,null,null,null,null,{"$f":"IF(N5<>'MASTER CONTROLS'!G3,I18+1,\"\")","v":"2022-05-02"},null,null,{"$f":"IF($U19>1,VLOOKUP($U19,'MASTER CONTROLS'!$A$3:$D$11,3,FALSE),\"\")","v":""},{"$f":"IF($U19>1,VLOOKUP($U19,'MASTER CONTROLS'!$A$3:$D$11,4,FALSE),\"\")","v":""},null,null,null,null,null,null,null,1,"Mon"]
[null,null,null,null,null,null,null,null,{"$f":"IF(N5<>'MASTER CONTROLS'!G3,I19+1,\"\")","v":"2022-05-03"},null,null,{"$f":"IF($U20>1,VLOOKUP($U20,'MASTER CONTROLS'!$A$3:$D$11,3,FALSE),\"\")","v":""},{"$f":"IF($U20>1,VLOOKUP($U20,'MASTER CONTROLS'!$A$3:$D$11,4,FALSE),\"\")","v":""},null,null,null,null,null,null,null,1,"Tue"]
[null,null,null,null,null,null,null,null,{"$f":"IF(N5<>'MASTER CONTROLS'!G3,I20+1,\"\")","v":"2022-05-04"},null,null,{"$f":"IF($U21>1,VLOOKUP($U21,'MASTER CONTROLS'!$A$3:$D$11,3,FALSE),\"\")","v":""},{"$f":"IF($U21>1,VLOOKUP($U21,'MASTER CONTROLS'!$A$3:$D$11,4,FALSE),\"\")","v":""},null,null,null,null,null,null,null,1,"Wed"]
[null,null,null,null,null,null,null,null,{"$f":"IF(N5<>'MASTER CONTROLS'!G3,I21+1,\"\")","v":"2022-05-05"},null,null,{"$f":"IF($U22>1,VLOOKUP($U22,'MASTER CONTROLS'!$A$3:$D$11,3,FALSE),\"\")","v":""},{"$f":"IF($U22>1,VLOOKUP($U22,'MASTER CONTROLS'!$A$3:$D$11,4,FALSE),\"\")","v":""},null,null,null,null,null,null,null,1,"Thu"]
[null,null,null,null,null,null,null,null,{"$f":"IF(N5<>'MASTER CONTROLS'!G3,I22+1,\"\")","v":"2022-05-06"},null,null,{"$f":"IF($U23>1,VLOOKUP($U23,'MASTER CONTROLS'!$A$3:$D$11,3,FALSE),\"\")","v":""},{"$f":"IF($U23>1,VLOOKUP($U23,'MASTER CONTROLS'!$A$3:$D$11,4,FALSE),\"\")","v":""},null,null,null,null,null,null,null,1,"Fri"]
[null,null,null,null,null,null,null,null,{"$f":"IF(N5<>'MASTER CONTROLS'!G3,I23+1,\"\")","v":"2022-05-07"},null,null,{"$f":"IF($U24>1,VLOOKUP($U24,'MASTER CONTROLS'!$A$3:$D$11,3,FALSE),\"\")","v":""},{"$f":"IF($U24>1,VLOOKUP($U24,'MASTER CONTROLS'!$A$3:$D$11,4,FALSE),\"\")","v":""},null,null,null,null,null,null,null,1,"Sat"]
[null,null,null,null,null,null,null,null,{"$f":"IF(N5<>'MASTER CONTROLS'!G3,I24+1,\"\")","v":"2022-05-08"},null,null,{"$f":"IF($U25>1,VLOOKUP($U25,'MASTER CONTROLS'!$A$3:$D$11,3,FALSE),\"\")","v":""},{"$f":"IF($U25>1,VLOOKUP($U25,'MASTER CONTROLS'!$A$3:$D$11,4,FALSE),\"\")","v":""},null,null,null,null,null,null,null,1,"Sun"]
[null,null,null,null,null,null,null,null,{"$f":"IF(N5<>'MASTER CONTROLS'!G3,I25+1,\"\")","v":"2022-05-09"},null,null,{"$f":"IF($U26>1,VLOOKUP($U26,'MASTER CONTROLS'!$A$3:$D$11,3,FALSE),\"\")","v":""},{"$f":"IF($U26>1,VLOOKUP($U26,'MASTER CONTROLS'!$A$3:$D$11,4,FALSE),\"\")","v":""},null,null,null,null,null,null,null,1,"Mon"]
[null,null,null,null,null,null,null,null,{"$f":"IF(N5<>'MASTER CONTROLS'!G3,I26+1,\"\")","v":"2022-05-10"},null,null,{"$f":"IF($U27>1,VLOOKUP($U27,'MASTER CONTROLS'!$A$3:$D$11,3,FALSE),\"\")","v":""},{"$f":"IF($U27>1,VLOOKUP($U27,'MASTER CONTROLS'!$A$3:$D$11,4,FALSE),\"\")","v":""},null,null,null,null,null,null,null,1,"Tue"]
[null,null,null,null,null,null,null,null,{"$f":"IF(N5<>'MASTER CONTROLS'!G3,I27+1,\"\")","v":"2022-05-11"},null,null,{"$f":"IF($U28>1,VLOOKUP($U28,'MASTER CONTROLS'!$A$3:$D$11,3,FALSE),\"\")","v":""},{"$f":"IF($U28>1,VLOOKUP($U28,'MASTER CONTROLS'!$A$3:$D$11,4,FALSE),\"\")","v":""},null,null,null,null,null,null,null,1,"Wed"]
[null,null,null,null,null,null,null,null,{"$f":"IF(N5<>'MASTER CONTROLS'!G3,I28+1,\"\")","v":"2022-05-12"},null,null,{"$f":"IF($U29>1,VLOOKUP($U29,'MASTER CONTROLS'!$A$3:$D$11,3,FALSE),\"\")","v":""},{"$f":"IF($U29>1,VLOOKUP($U29,'MASTER CONTROLS'!$A$3:$D$11,4,FALSE),\"\")","v":""},null,null,null,null,null,null,null,1,"Thu"]
[null,null,null,null,null,null,null,null,{"$f":"IF(N5<>'MASTER CONTROLS'!G3,I29+1,\"\")","v":"2022-05-13"},null,null,{"$f":"IF($U30>1,VLOOKUP($U30,'MASTER CONTROLS'!$A$3:$D$11,3,FALSE),\"\")","v":""},{"$f":"IF($U30>1,VLOOKUP($U30,'MASTER CONTROLS'!$A$3:$D$11,4,FALSE),\"\")","v":""},null,null,null,null,null,null,null,1,"Fri"]
[null,null,null,null,null,null,null,null,{"$f":"IF(N5<>'MASTER CONTROLS'!G3,I30+1,\"\")","v":"2022-05-14"},null,null,{"$f":"IF($U31>1,VLOOKUP($U31,'MASTER CONTROLS'!$A$3:$D$11,3,FALSE),\"\")","v":""},{"$f":"IF($U31>1,VLOOKUP($U31,'MASTER CONTROLS'!$A$3:$D$11,4,FALSE),\"\")","v":""},null,null,null,null,null,null,null,1,"Sat"]
[null,null,null,null,null,null,null,null,{"$f":"IF(N5<>'MASTER CONTROLS'!G3,I31+1,\"\")","v":"2022-05-15"},null,null,{"$f":"IF($U32>1,VLOOKUP($U32,'MASTER CONTROLS'!$A$3:$D$11,3,FALSE),\"\")","v":""},{"$f":"IF($U32>1,VLOOKUP($U32,'MASTER CONTROLS'!$A$3:$D$11,4,FALSE),\"\")","v":""},null,null,null,null,null,null,null,1,"Sun"]
[null,null,null,null,null,null,null,null,{"$f":"IF(N5<>'MASTER CONTROLS'!G3,I32+1,\"\")","v":"2022-05-16"},null,null,{"$f":"IF($U33>1,VLOOKUP($U33,'MASTER CONTROLS'!$A$3:$D$11,3,FALSE),\"\")","v":""},{"$f":"IF($U33>1,VLOOKUP($U33,'MASTER CONTROLS'!$A$3:$D$11,4,FALSE),\"\")","v":""},null,null,null,null,null,null,null,1,"Mon"]
[null,null,null,null,null,null,null,null,{"$f":"IF(N5<>'MASTER CONTROLS'!G3,I33+1,\"\")","v":"2022-05-17"},null,null,{"$f":"IF($U34>1,VLOOKUP($U34,'MASTER CONTROLS'!$A$3:$D$11,3,FALSE),\"\")","v":""},{"$f":"IF($U34>1,VLOOKUP($U34,'MASTER CONTROLS'!$A$3:$D$11,4,FALSE),\"\")","v":""},null,null,null,null,null,null,null,1,"Tue"]
[null,null,null,null,null,null,null,null,{"$f":"IF(N5<>'MASTER CONTROLS'!G3,I34+1,\"\")","v":"2022-05-18"},null,null,{"$f":"IF($U35>1,VLOOKUP($U35,'MASTER CONTROLS'!$A$3:$D$11,3,FALSE),\"\")","v":""},{"$f":"IF($U35>1,VLOOKUP($U35,'MASTER CONTROLS'!$A$3:$D$11,4,FALSE),\"\")","v":""},null,null,null,null,null,null,null,1,"Wed"]
[null,null,null,null,null,null,null,null,{"$f":"IF(N5<>'MASTER CONTROLS'!G3,I35+1,\"\")","v":"2022-05-19"},null,null,{"$f":"IF($U36>1,VLOOKUP($U36,'MASTER CONTROLS'!$A$3:$D$11,3,FALSE),\"\")","v":""},{"$f":"IF($U36>1,VLOOKUP($U36,'MASTER CONTROLS'!$A$3:$D$11,4,FALSE),\"\")","v":""},null,null,null,null,null,null,null,1,"Thu"]
[null,null,null,null,null,null,null,null,{"$f":"IF(N5<>'MASTER CONTROLS'!G3,I36+1,\"\")","v":"2022-05-20"},null,null,{"$f":"IF($U37>1,VLOOKUP($U37,'MASTER CONTROLS'!$A$3:$D$11,3,FALSE),\"\")","v":""},{"$f":"IF($U37>1,VLOOKUP($U37,'MASTER CONTROLS'!$A$3:$D$11,4,FALSE),\"\")","v":""},null,null,null,null,null,null,null,1,"Fri"]
[null,null,null,null,null,null,null,null,{"$f":"IF(N5<>'MASTER CONTROLS'!G3,I37+1,\"\")","v":"2022-05-21"},null,null,{"$f":"IF($U38>1,VLOOKUP($U38,'MASTER CONTROLS'!$A$3:$D$11,3,FALSE),\"\")","v":""},{"$f":"IF($U38>1,VLOOKUP($U38,'MASTER CONTROLS'!$A$3:$D$11,4,FALSE),\"\")","v":""},null,null,null,null,null,null,null,1,"Sat"]
[null,null,null,null,null,null,null,null,{"$f":"IF(N5<>'MASTER CONTROLS'!G3,I38+1,\"\")","v":"2022-05-22"},null,null,{"$f":"IF($U39>1,VLOOKUP($U39,'MASTER CONTROLS'!$A$3:$D$11,3,FALSE),\"\")","v":""},{"$f":"IF($U39>1,VLOOKUP($U39,'MASTER CONTROLS'!$A$3:$D$11,4,FALSE),\"\")","v":""},null,null,null,null,null,null,null,1,"Sun"]
[null,null,null,null,null,null,null,null,{"$f":"IF(N5<>'MASTER CONTROLS'!G3,I39+1,\"\")","v":"2022-05-23"},null,null,{"$f":"IF($U40>1,VLOOKUP($U40,'MASTER CONTROLS'!$A$3:$D$11,3,FALSE),\"\")","v":""},{"$f":"IF($U40>1,VLOOKUP($U40,'MASTER CONTROLS'!$A$3:$D$11,4,FALSE),\"\")","v":""},null,null,null,null,null,null,null,1,"Mon"]
[null,null,null,null,null,null,null,null,{"$f":"IF(N5<>'MASTER CONTROLS'!G3,I40+1,\"\")","v":"2022-05-24"},null,null,{"$f":"IF($U41>1,VLOOKUP($U41,'MASTER CONTROLS'!$A$3:$D$11,3,FALSE),\"\")","v":""},{"$f":"IF($U41>1,VLOOKUP($U41,'MASTER CONTROLS'!$A$3:$D$11,4,FALSE),\"\")","v":""},null,null,null,null,null,null,null,1,"Tue"]
[null,null,null,null,null,null,null,null,{"$f":"IF(N5<>'MASTER CONTROLS'!G3,I41+1,\"\")","v":"2022-05-25"},null,null,{"$f":"IF($U42>1,VLOOKUP($U42,'MASTER CONTROLS'!$A$3:$D$11,3,FALSE),\"\")","v":""},{"$f":"IF($U42>1,VLOOKUP($U42,'MASTER CONTROLS'!$A$3:$D$11,4,FALSE),\"\")","v":""},null,null,null,null,null,null,null,1,"Wed"]
[null,null,null,null,null,null,null,null,{"$f":"IF(N5<>'MASTER CONTROLS'!G3,I42+1,\"\")","v":"2022-05-26"},null,null,{"$f":"IF($U43>1,VLOOKUP($U43,'MASTER CONTROLS'!$A$3:$D$11,3,FALSE),\"\")","v":""},{"$f":"IF($U43>1,VLOOKUP($U43,'MASTER CONTROLS'!$A$3:$D$11,4,FALSE),\"\")","v":""},null,null,null,null,null,null,null,1,"Thu"]
[null,null,null,null,null,null,null,null,{"$f":"IF(N5<>'MASTER CONTROLS'!G3,I43+1,\"\")","v":"2022-05-27"},null,null,{"$f":"IF($U44>1,VLOOKUP($U44,'MASTER CONTROLS'!$A$3:$D$11,3,FALSE),\"\")","v":""},{"$f":"IF($U44>1,VLOOKUP($U44,'MASTER CONTROLS'!$A$3:$D$11,4,FALSE),\"\")","v":""},null,null,null,null,null,null,null,1,"Fri"]
[null,null,null,null,null,null,null,null,{"$f":"IF(N5<>'MASTER CONTROLS'!G3,I44+1,\"\")","v":"2022-05-28"},null,null,{"$f":"IF($U45>1,VLOOKUP($U45,'MASTER CONTROLS'!$A$3:$D$11,3,FALSE),\"\")","v":""},{"$f":"IF($U45>1,VLOOKUP($U45,'MASTER CONTROLS'!$A$3:$D$11,4,FALSE),\"\")","v":""},null,null,null,null,null,null,null,1,"Sat"]
[null,null,null,null,null,null,null,null,{"$f":"IF(N6<>'MASTER CONTROLS'!G4,I45+1,\"\")","v":"2022-05-29"},null,null,{"$f":"IF($U46>1,VLOOKUP($U46,'MASTER CONTROLS'!$A$3:$D$11,3,FALSE),\"\")","v":""},{"$f":"IF($U46>1,VLOOKUP($U46,'MASTER CONTROLS'!$A$3:$D$11,4,FALSE),\"\")","v":""},null,null,null,null,null,null,null,1,"Sun"]
[null,null,null,null,null,null,null,null,{"$f":"IF(N7<>'MASTER CONTROLS'!G5,I46+1,\"\")","v":"2022-05-30"},null,null,{"$f":"IF($U47>1,VLOOKUP($U47,'MASTER CONTROLS'!$A$3:$D$11,3,FALSE),\"\")","v":""},{"$f":"IF($U47>1,VLOOKUP($U47,'MASTER CONTROLS'!$A$3:$D$11,4,FALSE),\"\")","v":""},null,null,null,null,null,null,null,1,"Mon"]
[null,null,null,null,null,null,null,null,{"$f":"IF(N8<>'MASTER CONTROLS'!G6,I47+1,\"\")","v":"2022-05-31"},null,null,{"$f":"IF($U48>1,VLOOKUP($U48,'MASTER CONTROLS'!$A$3:$D$11,3,FALSE),\"\")","v":""},{"$f":"IF($U48>1,VLOOKUP($U48,'MASTER CONTROLS'!$A$3:$D$11,4,FALSE),\"\")","v":""},null,null,null,null,null,null,null,1,"Tue"]
["TOTALS",null,null,null,null,null,{"$f":"SUM(G18:H48)","v":0},null,null,null,{"$f":"SUM(K18:K48)","v":0},0,0,0,0,0]
[]
["Office Staff Section",null,null,null,null,null,null,null,null,null,null,null,null,"Phone","Internet","Total"]
[null,null,null,null,null,null,null,null,null,null,null,null,null,null,null,{"$f":"SUM(N52:O52)","v":0}]
[]
["Pastor's Section",null,null,null,null,null,null,null,{"$f":"Jan!I54","v":"Profession of Faith"},null,null,"Worship Service Attendance"]
[{"$f":"Jan!A55","v":"Church Name "},null,null,null,null,null,null,"Baptisms",null,null,"Transfers","Week 1","Week 2","Week 3","Week 4","Week 5"]
[null,null,null,null,null,null,null,null,null,null,null,null,null,null,null,null,{"$f":"COUNTIF(V18:V48,\"Sat\")","v":4},{"$f":"COUNT(G56:P56)","v":0}]
[]
[]
[]
[]
["Comments & Notes"]
[]
[null,null,null,null,null,null,null,null,null,null,null,null,null,null,null,null,null,null,null,null,false]
[]
["OFFICE USE ONLY"]
["10200) Travel Budget",null,null,null,null,null,"10201) Per Diem Tx",null,null,null,null,null,"11206) Travel Misc"]
["11211) Non-Tax Miles",null,null,null,null,null,"11201) Per Diem NTx",null,null,null,null,null,"11230) Conv./Mtgs"]
["11200) Special Miles",null,null,null,null,null,"11202) Lodging",null,null,null,null,null,"11403) Phone"]
["10212) Spouse Travel",null,null,null,null,null,"11203) Car Rental",null,null,null,null,null,"10408) Internet"]
["11405) Entertainment",null,null,null,null,null,"11209) Airfare Travel"]

{"sheet":"Jun","index":6,"n_rows":70,"n_cols":22,"rows_kept":70,"cut":false,"hidden":false,"merged":[[19,6,19,7],[18,6,18,7],[17,6,17,7],[10,6,10,7],[29,6,29,7],[28,6,28,7],[27,6,27,7],[26,6,26,7],[25,6,25,7],[24,6,24,7],[23,6,23,7],[22,6,22,7],[21,6,21,7],[44,6,44,7],[43,6,43,7],[42,6,42,7],[41,6,41,7],[40,6,40,7],[67,0,67,2],[69,0,69,1],[69,6,69,7],[20,6,20,7],[38,6,38,7],[37,6,37,7],[36,6,36,7],[35,6,35,7],[34,6,34,7],[33,6,33,7],[32,6,32,7],[39,8,39,9],[46,8,46,9],[26,8,26,9],[31,1,31,5],[32,1,32,5],[34,8,34,9],[33,8,33,9],[30,8,30,9],[38,8,38,9],[42,8,42,9],[44,1,44,5],[43,1,43,5],[34,1,34,5],[36,1,36,5],[35,1,35,5],[39,1,39,5],[40,1,40,5],[36,8,36,9],[37,8,37,9],[41,8,41,9],[29,8,29,9],[31,6,31,7],[30,6,30,7],[46,6,46,7],[69,12,69,13],[68,14,68,15],[65,14,65,15],[66,14,66,15],[67,14,67,15],[65,12,65,13],[0,0,0,15],[37,1,37,5],[38,1,38,5],[9,1,9,5],[10,1,10,5],[17,1,17,5],[9,14,10,15],[9,6,9,7],[35,8,35,9],[1,0,1,15],[8,10,8,12],[3,1,3,9],[7,5,7,10],[4,1,4,9],[5,1,5,9],[19,1,19,5],[19,8,19,9],[8,0,8,9],[68,12,68,13],[66,0,66,2],[67,6,67,8],[68,6,68,8],[47,1,47,5],[59,0,59,2],[68,3,68,4],[68,0,68,2],[55,0,55,6],[56,0,56,6],[59,6,59,8],[57,0,57,6],[64,0,64,15],[66,6,66,8],[59,9,59,10],[50,0,50,2],[54,0,54,5],[60,2,61,15],[59,11,59,12],[47,8,47,9],[56,8,56,9],[55,8,55,9],[48,6,48,7],[47,6,47,7],[18,8,18,9],[3,16,3,19],[4,16,6,19],[7,16,7,19],[6,0,6,9],[7,1,7,3],[9,11,9,12],[4,13,4,15],[5,13,5,15],[6,13,8,15],[18,1,18,5],[9,8,10,9],[17,8,17,9],[21,8,21,9],[40,8,40,9],[31,8,31,9],[32,8,32,9],[20,8,20,9],[24,8,24,9],[25,1,25,5],[22,1,22,5],[27,8,27,9],[23,8,23,9],[21,1,21,5],[25,8,25,9],[22,8,22,9],[20,1,20,5],[24,1,24,5],[27,1,27,5],[23,1,23,5],[29,1,29,5],[30,1,30,5],[28,1,28,5],[28,8,28,9],[33,1,33,5],[26,1,26,5],[39,6,39,7],[45,1,45,5],[48,0,48,5],[67,12,67,13],[66,12,66,13],[41,1,41,5],[46,1,46,5],[65,3,65,4],[65,0,65,2],[65,6,65,8],[66,3,66,4],[53,0,53,1],[48,8,48,9],[53,8,54,9],[51,0,51,12],[53,11,53,15],[67,3,67,4],[42,1,42,5],[60,0,61,1],[59,13,59,14],[57,8,57,9],[44,8,44,9],[43,8,43,9],[45,8,45,9],[45,6,45,7]]}
[{"$f":"\"Northern California Conference Expense Report\" & IF($U$63=TRUE,\" (REVISED)\",\"\")","v":"Northern California Conference Expense Report"}]
[{"$f":"Jan!A2","v":"Email to: payroll@nccsda.com      "},null,null,null,null,null,null,null,null,null,null,null,null,null,null,null,null,null,null,null,false]
[]
["Name",{"$f":"IF(May!B4<>\"\",May!B4,\"\")","v":""},null,null,{"$f":"IF(Jan!E4<>\"\",Jan!E4,\"\")","v":""},null,null,{"$f":"IF(Jan!H4<>\"\",Jan!H4,\"\")","v":""},null,null,null,null,null,null,null,null,"Per Diem Note:"]
["Address",{"$f":"IF(May!B5<>\"\",May!B5,\"\")","v":""},null,null,{"$f":"IF(Jan!E5<>\"\",Jan!E5,\"\")","v":""},null,null,{"$f":"IF(Jan!H5<>\"\",Jan!H5,\"\")","v":""},null,null,null,null,null,{"$f":"'MASTER CONTROLS'!G9","v":"2022-06-01"},null,null,"1) If you are away from home and have an overnight stay on either side of a day you qualify for per diem, choose an option with NT."]
[null,{"$f":"IF(May!B6<>\"\",May!B6,\"\")","v":""},null,null,{"$f":"IF(Jan!E6<>\"\",Jan!E6,\"\")","v":""},null,null,{"$f":"IF(Jan!H6<>\"\",Jan!H6,\"\")","v":""},null,null,null,null,null,{"$f":" IF(N5<>'MASTER CONTROLS'!G3,\"Due \" & TEXT(DATE(1,MONTH(I18)+1,1),\"mmmm\") & \" 3rd.\",\"\")","v":"Due July 3rd."}]
["Best way to contact:",null,null,null,null,null,null,null,null,null,null,null,null,"*Reimbursements are made for completed reports including original receipts with travel approval from ADCO or assigned job duties. Lodging must be documented with a folio."]
["Phone:",{"$f":"IF(May!B8<>\"\",May!B8,\"\")","v":""},null,null,"Email:",{"$f":"IF(May!F8<>\"\",May!F8,\"\")","v":""},null,null,{"$f":"IF(Jan!I8<>\"\",Jan!I8,\"\")","v":""},null,null,null,null,null,null,null,{"$f":"Jan!Q8","v":"2) Per diem for events that do not include an overnight stay are taxable. Spousal per diems are always taxable."}]
[{"$f":"Jan!A9","v":"Please log in to APS Employee online to update your address and phone number."},null,null,null,null,null,null,null,null,null,"** ADCO must approve Special Mileage."]
["Short","Daily Activity Description",null,null,null,null,null,null,"Date",null,"Special","Per Diem",null,null,"Air/Car/Gas/Transit    Other",null,null,"PD Tx","PD NTx","Per Diem","Ans: Per"]
["Description","Example: Visitation, Sermon Prep, etc.",null,null,null,null,"Budgeted Mileage",null,null,null,"Mileage**","Taxable","Non-Tax","Lodging*",null,null,null,{"$f":"$L$49","v":0},{"$f":"$M$49","v":0},"Totals","Diem"]
[]
["Worked"]
["Day Off"]
["Vacation"]
["Sick Day"]
["Holiday"]
[null,null,null,null,null,null,null,null,{"$f":"IF(N5<>'MASTER CONTROLS'!G3,N5,\"\")","v":"2022-06-01"},null,null,{"$f":"IF($U18>1,VLOOKUP($U18,'MASTER CONTROLS'!$A$3:$D$11,3,FALSE),\"\")","v":""},{"$f":"IF($U18>1,VLOOKUP($U18,'MASTER CONTROLS'!$A$3:$D$11,4,FALSE),\"\")","v":""},null,null,null,null,null,null,null,1,{"$f":"TEXT(I18,\"ddd\")","v":"Wed"}]
[null,null,null,null,null,null,null,null,{"$f":"IF(N5<>'MASTER CONTROLS'!G3,I18+1,\"\")","v":"2022-06-02"},null,null,{"$f":"IF($U19>1,VLOOKUP($U19,'MASTER CONTROLS'!$A$3:$D$11,3,FALSE),\"\")","v":""},{"$f":"IF($U19>1,VLOOKUP($U19,'MASTER CONTROLS'!$A$3:$D$11,4,FALSE),\"\")","v":""},null,null,null,null,null,null,null,1,"Thu"]
[null,null,null,null,null,null,null,null,{"$f":"IF(N5<>'MASTER CONTROLS'!G3,I19+1,\"\")","v":"2022-06-03"},null,null,{"$f":"IF($U20>1,VLOOKUP($U20,'MASTER CONTROLS'!$A$3:$D$11,3,FALSE),\"\")","v":""},{"$f":"IF($U20>1,VLOOKUP($U20,'MASTER CONTROLS'!$A$3:$D$11,4,FALSE),\"\")","v":""},null,null,null,null,null,null,null,1,"Fri"]
[null,null,null,null,null,null,null,null,{"$f":"IF(N5<>'MASTER CONTROLS'!G3,I20+1,\"\")","v":"2022-06-04"},null,null,{"$f":"IF($U21>1,VLOOKUP($U21,'MASTER CONTROLS'!$A$3:$D$11,3,FALSE),\"\")","v":""},{"$f":"IF($U21>1,VLOOKUP($U21,'MASTER CONTROLS'!$A$3:$D$11,4,FALSE),\"\")","v":""},null,null,null,null,null,null,null,1,"Sat"]
[null,null,null,null,null,null,null,null,{"$f":"IF(N5<>'MASTER CONTROLS'!G3,I21+1,\"\")","v":"2022-06-05"},null,null,{"$f":"IF($U22>1,VLOOKUP($U22,'MASTER CONTROLS'!$A$3:$D$11,3,FALSE),\"\")","v":""},{"$f":"IF($U22>1,VLOOKUP($U22,'MASTER CONTROLS'!$A$3:$D$11,4,FALSE),\"\")","v":""},null,null,null,null,null,null,null,1,"Sun"]
[null,null,null,null,null,null,null,null,{"$f":"IF(N5<>'MASTER CONTROLS'!G3,I22+1,\"\")","v":"2022-06-06"},null,null,{"$f":"IF($U23>1,VLOOKUP($U23,'MASTER CONTROLS'!$A$3:$D$11,3,FALSE),\"\")","v":""},{"$f":"IF($U23>1,VLOOKUP($U23,'MASTER CONTROLS'!$A$3:$D$11,4,FALSE),\"\")","v":""},null,null,null,null,null,null,null,1,"Mon"]
[null,null,null,null,null,null,null,null,{"$f":"IF(N5<>'MASTER CONTROLS'!G3,I23+1,\"\")","v":"2022-06-07"},null,null,{"$f":"IF($U24>1,VLOOKUP($U24,'MASTER CONTROLS'!$A$3:$D$11,3,FALSE),\"\")","v":""},{"$f":"IF($U24>1,VLOOKUP($U24,'MASTER CONTROLS'!$A$3:$D$11,4,FALSE),\"\")","v":""},null,null,null,null,null,null,null,1,"Tue"]
[null,null,null,null,null,null,null,null,{"$f":"IF(N5<>'MASTER CONTROLS'!G3,I24+1,\"\")","v":"2022-06-08"},null,null,{"$f":"IF($U25>1,VLOOKUP($U25,'MASTER CONTROLS'!$A$3:$D$11,3,FALSE),\"\")","v":""},{"$f":"IF($U25>1,VLOOKUP($U25,'MASTER CONTROLS'!$A$3:$D$11,4,FALSE),\"\")","v":""},null,null,null,null,null,null,null,1,"Wed"]
[null,null,null,null,null,null,null,null,{"$f":"IF(N5<>'MASTER CONTROLS'!G3,I25+1,\"\")","v":"2022-06-09"},null,null,{"$f":"IF($U26>1,VLOOKUP($U26,'MASTER CONTROLS'!$A$3:$D$11,3,FALSE),\"\")","v":""},{"$f":"IF($U26>1,VLOOKUP($U26,'MASTER CONTROLS'!$A$3:$D$11,4,FALSE),\"\")","v":""},null,null,null,null,null,null,null,1,"Thu"]
[null,null,null,null,null,null,null,null,{"$f":"IF(N5<>'MASTER CONTROLS'!G3,I26+1,\"\")","v":"2022-06-10"},null,null,{"$f":"IF($U27>1,VLOOKUP($U27,'MASTER CONTROLS'!$A$3:$D$11,3,FALSE),\"\")","v":""},{"$f":"IF($U27>1,VLOOKUP($U27,'MASTER CONTROLS'!$A$3:$D$11,4,FALSE),\"\")","v":""},null,null,null,null,null,null,null,1,"Fri"]
[null,null,null,null,null,null,null,null,{"$f":"IF(N5<>'MASTER CONTROLS'!G3,I27+1,\"\")","v":"2022-06-11"},null,null,{"$f":"IF($U28>1,VLOOKUP($U28,'MASTER CONTROLS'!$A$3:$D$11,3,FALSE),\"\")","v":""},{"$f":"IF($U28>1,VLOOKUP($U28,'MASTER CONTROLS'!$A$3:$D$11,4,FALSE),\"\")","v":""},null,null,null,null,null,null,null,1,"Sat"]
[null,null,null,null,null,null,null,null,{"$f":"IF(N5<>'MASTER CONTROLS'!G3,I28+1,\"\")","v":"2022-06-12"},null,null,{"$f":"IF($U29>1,VLOOKUP($U29,'MASTER CONTROLS'!$A$3:$D$11,3,FALSE),\"\")","v":""},{"$f":"IF($U29>1,VLOOKUP($U29,'MASTER CONTROLS'!$A$3:$D$11,4,FALSE),\"\")","v":""},null,null,null,null,null,null,null,1,"Sun"]
[null,null,null,null,null,null,null,null,{"$f":"IF(N5<>'MASTER CONTROLS'!G3,I29+1,\"\")","v":"2022-06-13"},null,null,{"$f":"IF($U30>1,VLOOKUP($U30,'MASTER CONTROLS'!$A$3:$D$11,3,FALSE),\"\")","v":""},{"$f":"IF($U30>1,VLOOKUP($U30,'MASTER CONTROLS'!$A$3:$D$11,4,FALSE),\"\")","v":""},null,null,null,null,null,null,null,1,"Mon"]
[null,null,null,null,null,null,null,null,{"$f":"IF(N5<>'MASTER CONTROLS'!G3,I30+1,\"\")","v":"2022-06-14"},null,null,{"$f":"IF($U31>1,VLOOKUP($U31,'MASTER CONTROLS'!$A$3:$D$11,3,FALSE),\"\")","v":""},{"$f":"IF($U31>1,VLOOKUP($U31,'MASTER CONTROLS'!$A$3:$D$11,4,FALSE),\"\")","v":""},null,null,null,null,null,null,null,1,"Tue"]
[null,null,null,null,null,null,null,null,{"$f":"IF(N5<>'MASTER CONTROLS'!G3,I31+1,\"\")","v":"2022-06-15"},null,null,{"$f":"IF($U32>1,VLOOKUP($U32,'MASTER CONTROLS'!$A$3:$D$11,3,FALSE),\"\")","v":""},{"$f":"IF($U32>1,VLOOKUP($U32,'MASTER CONTROLS'!$A$3:$D$11,4,FALSE),\"\")","v":""},null,null,null,null,null,null,null,1,"Wed"]
[null,null,null,null,null,null,null,null,{"$f":"IF(N5<>'MASTER CONTROLS'!G3,I32+1,\"\")","v":"2022-06-16"},null,null,{"$f":"IF($U33>1,VLOOKUP($U33,'MASTER CONTROLS'!$A$3:$D$11,3,FALSE),\"\")","v":""},{"$f":"IF($U33>1,VLOOKUP($U33,'MASTER CONTROLS'!$A$3:$D$11,4,FALSE),\"\")","v":""},null,null,null,null,null,null,null,1,"Thu"]
[null,null,null,null,null,null,null,null,{"$f":"IF(N5<>'MASTER CONTROLS'!G3,I33+1,\"\")","v":"2022-06-17"},null,null,{"$f":"IF($U34>1,VLOOKUP($U34,'MASTER CONTROLS'!$A$3:$D$11,3,FALSE),\"\")","v":""},{"$f":"IF($U34>1,VLOOKUP($U34,'MASTER CONTROLS'!$A$3:$D$11,4,FALSE),\"\")","v":""},null,null,null,null,null,null,null,1,"Fri"]
[null,null,null,null,null,null,null,null,{"$f":"IF(N5<>'MASTER CONTROLS'!G3,I34+1,\"\")","v":"2022-06-18"},null,null,{"$f":"IF($U35>1,VLOOKUP($U35,'MASTER CONTROLS'!$A$3:$D$11,3,FALSE),\"\")","v":""},{"$f":"IF($U35>1,VLOOKUP($U35,'MASTER CONTROLS'!$A$3:$D$11,4,FALSE),\"\")","v":""},null,null,null,null,null,null,null,1,"Sat"]
[null,null,null,null,null,null,null,null,{"$f":"IF(N5<>'MASTER CONTROLS'!G3,I35+1,\"\")","v":"2022-06-19"},null,null,{"$f":"IF($U36>1,VLOOKUP($U36,'MASTER CONTROLS'!$A$3:$D$11,3,FALSE),\"\")","v":""},{"$f":"IF($U36>1,VLOOKUP($U36,'MASTER CONTROLS'!$A$3:$D$11,4,FALSE),\"\")","v":""},null,null,null,null,null,null,null,1,"Sun"]
[null,null,null,null,null,null,null,null,{"$f":"IF(N5<>'MASTER CONTROLS'!G3,I36+1,\"\")","v":"2022-06-20"},null,null,{"$f":"IF($U37>1,VLOOKUP($U37,'MASTER CONTROLS'!$A$3:$D$11,3,FALSE),\"\")","v":""},{"$f":"IF($U37>1,VLOOKUP($U37,'MASTER CONTROLS'!$A$3:$D$11,4,FALSE),\"\")","v":""},null,null,null,null,null,null,null,1,"Mon"]
[null,null,null,null,null,null,null,null,{"$f":"IF(N5<>'MASTER CONTROLS'!G3,I37+1,\"\")","v":"2022-06-21"},null,null,{"$f":"IF($U38>1,VLOOKUP($U38,'MASTER CONTROLS'!$A$3:$D$11,3,FALSE),\"\")","v":""},{"$f":"IF($U38>1,VLOOKUP($U38,'MASTER CONTROLS'!$A$3:$D$11,4,FALSE),\"\")","v":""},null,null,null,null,null,null,null,1,"Tue"]
[null,null,null,null,null,null,null,null,{"$f":"IF(N5<>'MASTER CONTROLS'!G3,I38+1,\"\")","v":"2022-06-22"},null,null,{"$f":"IF($U39>1,VLOOKUP($U39,'MASTER CONTROLS'!$A$3:$D$11,3,FALSE),\"\")","v":""},{"$f":"IF($U39>1,VLOOKUP($U39,'MASTER CONTROLS'!$A$3:$D$11,4,FALSE),\"\")","v":""},null,null,null,null,null,null,null,1,"Wed"]
[null,null,null,null,null,null,null,null,{"$f":"IF(N5<>'MASTER CONTROLS'!G3,I39+1,\"\")","v":"2022-06-23"},null,null,{"$f":"IF($U40>1,VLOOKUP($U40,'MASTER CONTROLS'!$A$3:$D$11,3,FALSE),\"\")","v":""},{"$f":"IF($U40>1,VLOOKUP($U40,'MASTER CONTROLS'!$A$3:$D$11,4,FALSE),\"\")","v":""},null,null,null,null,null,null,null,1,"Thu"]
[null,null,null,null,null,null,null,null,{"$f":"IF(N5<>'MASTER CONTROLS'!G3,I40+1,\"\")","v":"2022-06-24"},null,null,{"$f":"IF($U41>1,VLOOKUP($U41,'MASTER CONTROLS'!$A$3:$D$11,3,FALSE),\"\")","v":""},{"$f":"IF($U41>1,VLOOKUP($U41,'MASTER CONTROLS'!$A$3:$D$11,4,FALSE),\"\")","v":""},null,null,null,null,null,null,null,1,"Fri"]
[null,null,null,null,null,null,null,null,{"$f":"IF(N5<>'MASTER CONTROLS'!G3,I41+1,\"\")","v":"2022-06-25"},null,null,{"$f":"IF($U42>1,VLOOKUP($U42,'MASTER CONTROLS'!$A$3:$D$11,3,FALSE),\"\")","v":""},{"$f":"IF($U42>1,VLOOKUP($U42,'MASTER CONTROLS'!$A$3:$D$11,4,FALSE),\"\")","v":""},null,null,null,null,null,null,null,1,"Sat"]
[null,null,null,null,null,null,null,null,{"$f":"IF(N5<>'MASTER CONTROLS'!G3,I42+1,\"\")","v":"2022-06-26"},null,null,{"$f":"IF($U43>1,VLOOKUP($U43,'MASTER CONTROLS'!$A$3:$D$11,3,FALSE),\"\")","v":""},{"$f":"IF($U43>1,VLOOKUP($U43,'MASTER CONTROLS'!$A$3:$D$11,4,FALSE),\"\")","v":""},null,null,null,null,null,null,null,1,"Sun"]
[null,null,null,null,null,null,null,null,{"$f":"IF(N5<>'MASTER CONTROLS'!G3,I43+1,\"\")","v":"2022-06-27"},null,null,{"$f":"IF($U44>1,VLOOKUP($U44,'MASTER CONTROLS'!$A$3:$D$11,3,FALSE),\"\")","v":""},{"$f":"IF($U44>1,VLOOKUP($U44,'MASTER CONTROLS'!$A$3:$D$11,4,FALSE),\"\")","v":""},null,null,null,null,null,null,null,1,"Mon"]
[null,null,null,null,null,null,null,null,{"$f":"IF(N5<>'MASTER CONTROLS'!G3,I44+1,\"\")","v":"2022-06-28"},null,null,{"$f":"IF($U45>1,VLOOKUP($U45,'MASTER CONTROLS'!$A$3:$D$11,3,FALSE),\"\")","v":""},{"$f":"IF($U45>1,VLOOKUP($U45,'MASTER CONTROLS'!$A$3:$D$11,4,FALSE),\"\")","v":""},null,null,null,null,null,null,null,1,"Tue"]
[null,null,null,null,null,null,null,null,{"$f":"IF(AND(N$5<>'MASTER CONTROLS'!$G$3,I45<VLOOKUP(N$5,'MASTER CONTROLS'!$G$3:$I$15,3)),I45+1,\"\")","v":"2022-06-29"},null,null,{"$f":"IF($U46>1,VLOOKUP($U46,'MASTER CONTROLS'!$A$3:$D$11,3,FALSE),\"\")","v":""},{"$f":"IF($U46>1,VLOOKUP($U46,'MASTER CONTROLS'!$A$3:$D$11,4,FALSE),\"\")","v":""},null,null,null,null,null,null,null,1,"Wed"]
[null,null,null,null,null,null,null,null,{"$f":"IF(AND(N$5<>'MASTER CONTROLS'!$G$3,I46<VLOOKUP(N$5,'MASTER CONTROLS'!$G$3:$I$15,3)),I46+1,\"\")","v":"2022-06-30"},null,null,{"$f":"IF($U47>1,VLOOKUP($U47,'MASTER CONTROLS'!$A$3:$D$11,3,FALSE),\"\")","v":""},{"$f":"IF($U47>1,VLOOKUP($U47,'MASTER CONTROLS'!$A$3:$D$11,4,FALSE),\"\")","v":""},null,null,null,null,null,null,null,1,"Thu"]
[null,null,null,null,null,null,null,null,{"$f":"IF(AND(N$5<>'MASTER CONTROLS'!$G$3,I47<VLOOKUP(N$5,'MASTER CONTROLS'!$G$3:$I$15,3)),I47+1,\"\")","v":""},null,null,{"$f":"IF($U48>1,VLOOKUP($U48,'MASTER CONTROLS'!$A$3:$D$11,3,FALSE),\"\")","v":""},{"$f":"IF($U48>1,VLOOKUP($U48,'MASTER CONTROLS'!$A$3:$D$11,4,FALSE),\"\")","v":""},null,null,null,null,null,null,null,1,""]
["TOTALS",null,null,null,null,null,{"$f":"SUM(G18:H48)","v":0},null,null,null,{"$f":"SUM(K18:K48)","v":0},0,0,0,0,0]
[]
["Office Staff Section",null,null,null,null,null,null,null,null,null,null,null,null,"Phone","Internet","Total"]
[null,null,null,null,null,null,null,null,null,null,null,null,null,null,null,{"$f":"SUM(N52:O52)","v":0}]
[]
["Pastor's Section",null,null,null,null,null,null,null,{"$f":"Jan!I54","v":"Profession of Faith"},null,null,"Worship Service Attendance"]
[{"$f":"Jan!A55","v":"Church Name "},null,null,null,null,null,null,"Baptisms",null,null,"Transfers","Week 1","Week 2","Week 3","Week 4","Week 5"]
[null,null,null,null,null,null,null,null,null,null,null,null,null,null,null,null,{"$f":"COUNTIF(V18:V48,\"Sat\")","v":4},{"$f":"COUNT(G56:P56)","v":0}]
[]
[]
[]
[]
["Comments & Notes"]
[]
[null,null,null,null,null,null,null,null,null,null,null,null,null,null,null,null,null,null,null,null,false]
[]
["OFFICE USE ONLY"]
["10200) Travel Budget",null,null,null,null,null,"10201) Per Diem Tx",null,null,null,null,null,"11206) Travel Misc"]
["11211) Non-Tax Miles",null,null,null,null,null,"11201) Per Diem NTx",null,null,null,null,null,"11230) Conv./Mtgs"]
["11200) Special Miles",null,null,null,null,null,"11202) Lodging",null,null,null,null,null,"11403) Phone"]
["10212) Spouse Travel",null,null,null,null,null,"11203) Car Rental",null,null,null,null,null,"10408) Internet"]
["11405) Entertainment",null,null,null,null,null,"11209) Airfare Travel"]

{"sheet":"Jul","index":7,"n_rows":70,"n_cols":22,"rows_kept":70,"cut":false,"hidden":false,"merged":[[69,0,69,1],[69,6,69,7],[21,6,21,7],[20,6,20,7],[19,6,19,7],[18,6,18,7],[17,6,17,7],[10,6,10,7],[30,6,30,7],[29,6,29,7],[28,6,28,7],[27,6,27,7],[26,6,26,7],[25,6,25,7],[24,6,24,7],[23,6,23,7],[22,6,22,7],[46,6,46,7],[45,6,45,7],[44,6,44,7],[43,6,43,7],[42,6,42,7],[41,6,41,7],[18,1,18,5],[4,13,4,15],[5,13,5,15],[6,13,8,15],[8,0,8,9],[8,10,8,12],[3,1,3,9],[7,5,7,10],[4,1,4,9],[5,1,5,9],[17,1,17,5],[9,14,10,15],[17,8,17,9],[3,16,3,19],[4,16,6,19],[7,16,7,19],[6,0,6,9],[7,1,7,3],[9,11,9,12],[9,8,10,9],[69,12,69,13],[41,1,41,5],[46,1,46,5],[47,1,47,5],[42,1,42,5],[44,1,44,5],[67,6,67,8],[64,0,64,15],[66,3,66,4],[67,3,67,4],[68,12,68,13],[66,0,66,2],[67,12,67,13],[66,12,66,13],[44,8,44,9],[68,14,68,15],[59,0,59,2],[68,3,68,4],[47,8,47,9],[56,8,56,9],[59,6,59,8],[57,0,57,6],[65,6,65,8],[65,14,65,15],[0,0,0,15],[37,1,37,5],[38,1,38,5],[9,1,9,5],[10,1,10,5],[9,6,9,7],[36,1,36,5],[35,1,35,5],[19,8,19,9],[21,8,21,9],[22,1,22,5],[24,1,24,5],[26,1,26,5],[25,1,25,5],[28,1,28,5],[31,1,31,5],[32,1,32,5],[31,8,31,9],[32,8,32,9],[20,8,20,9],[22,8,22,9],[24,8,24,9],[18,8,18,9],[1,0,1,15],[19,1,19,5],[20,1,20,5],[21,1,21,5],[36,8,36,9],[25,8,25,9],[29,1,29,5],[30,1,30,5],[37,8,37,9],[35,8,35,9],[26,8,26,9],[23,8,23,9],[28,8,28,9],[27,1,27,5],[23,1,23,5],[27,8,27,9],[30,8,30,9],[37,6,37,7],[36,6,36,7],[35,6,35,7],[34,6,34,7],[33,6,33,7],[32,6,32,7],[31,6,31,7],[29,8,29,9],[39,8,39,9],[40,1,40,5],[43,1,43,5],[34,1,34,5],[33,8,33,9],[38,8,38,9],[40,8,40,9],[33,1,33,5],[43,8,43,9],[34,8,34,9],[42,8,42,9],[41,8,41,9],[39,1,39,5],[40,6,40,7],[39,6,39,7],[38,6,38,7],[47,6,47,7],[46,8,46,9],[66,6,66,8],[45,8,45,9],[60,0,61,1],[54,0,54,5],[45,1,45,5],[55,8,55,9],[57,8,57,9],[68,0,68,2],[53,0,53,1],[48,8,48,9],[53,8,54,9],[51,0,51,12],[50,0,50,2],[53,11,53,15],[65,12,65,13],[59,9,59,10],[68,6,68,8],[60,2,61,15],[59,11,59,12],[66,14,66,15],[67,14,67,15],[65,0,65,2],[59,13,59,14],[48,0,48,5],[65,3,65,4],[55,0,55,6],[56,0,56,6],[48,6,48,7],[67,0,67,2]]}
[{"$f":"\"Northern California Conference Expense Report\" & IF($U$63=TRUE,\" (REVISED)\",\"\")","v":"Northern California Conference Expense Report"}]
[{"$f":"Jan!A2","v":"Email to: payroll@nccsda.com      "},null,null,null,null,null,null,null,null,null,null,null,null,null,null,null,null,null,null,null,false]
[]
["Name",{"$f":"IF(Jun!B4<>\"\",Jun!B4,\"\")","v":""},null,null,{"$f":"IF(Jan!E4<>\"\",Jan!E4,\"\")","v":""},null,null,{"$f":"IF(Jan!H4<>\"\",Jan!H4,\"\")","v":""},null,null,null,null,null,null,null,null,"Per Diem Note:"]
["Address",{"$f":"IF(Jun!B5<>\"\",Jun!B5,\"\")","v":""},null,null,{"$f":"IF(Jan!E5<>\"\",Jan!E5,\"\")","v":""},null,null,{"$f":"IF(Jan!H5<>\"\",Jan!H5,\"\")","v":""},null,null,null,null,null,{"$f":"'MASTER CONTROLS'!G10","v":"2022-07-01"},null,null,"1) If you are away from home and have an overnight stay on either side of a day you qualify for per diem, choose an option with NT."]
[null,{"$f":"IF(Jun!B6<>\"\",Jun!B6,\"\")","v":""},null,null,{"$f":"IF(Jan!E6<>\"\",Jan!E6,\"\")","v":""},null,null,{"$f":"IF(Jan!H6<>\"\",Jan!H6,\"\")","v":""},null,null,null,null,null,{"$f":" IF(N5<>'MASTER CONTROLS'!G3,\"Due \" & TEXT(DATE(1,MONTH(I18)+1,1),\"mmmm\") & \" 3rd.\",\"\")","v":"Due August 3rd."}]
["Best way to contact:",null,null,null,null,null,null,null,null,null,null,null,null,"*Reimbursements are made for completed reports including original receipts with travel approval from ADCO or assigned job duties. Lodging must be documented with a folio."]
["Phone:",{"$f":"IF(Jun!B8<>\"\",Jun!B8,\"\")","v":""},null,null,"Email:",{"$f":"IF(Jun!F8<>\"\",Jun!F8,\"\")","v":""},null,null,{"$f":"IF(Jan!I8<>\"\",Jan!I8,\"\")","v":""},null,null,null,null,null,null,null,{"$f":"Jan!Q8","v":"2) Per diem for events that do not include an overnight stay are taxable. Spousal per diems are always taxable."}]
[{"$f":"Jan!A9","v":"Please log in to APS Employee online to update your address and phone number."},null,null,null,null,null,null,null,null,null,"** ADCO must approve Special Mileage."]
["Short","Daily Activity Description",null,null,null,null,null,null,"Date",null,"Special","Per Diem",null,null,"Air/Car/Gas/Transit    Other",null,null,"PD Tx","PD NTx","Per Diem","Ans: Per"]
["Description","Example: Visitation, Sermon Prep, etc.",null,null,null,null,"Budgeted Mileage",null,null,null,"Mileage**","Taxable","Non-Tax","Lodging*",null,null,null,{"$f":"$L$49","v":0},{"$f":"$M$49","v":0},"Totals","Diem"]
[]
["Worked"]
["Day Off"]
["Vacation"]
["Sick Day"]
["Holiday"]
[null,null,null,null,null,null,null,null,{"$f":"IF(N5<>'MASTER CONTROLS'!G3,N5,\"\")","v":"2022-07-01"},null,null,{"$f":"IF($U18>1,VLOOKUP($U18,'MASTER CONTROLS'!$A$3:$D$11,3,FALSE),\"\")","v":""},{"$f":"IF($U18>1,VLOOKUP($U18,'MASTER CONTROLS'!$A$3:$D$11,4,FALSE),\"\")","v":""},null,null,null,null,null,null,null,1,{"$f":"TEXT(I18,\"ddd\")","v":"Fri"}]
[null,null,null,null,null,null,null,null,{"$f":"IF(N5<>'MASTER CONTROLS'!G3,I18+1,\"\")","v":"2022-07-02"},null,null,{"$f":"IF($U19>1,VLOOKUP($U19,'MASTER CONTROLS'!$A$3:$D$11,3,FALSE),\"\")","v":""},{"$f":"IF($U19>1,VLOOKUP($U19,'MASTER CONTROLS'!$A$3:$D$11,4,FALSE),\"\")","v":""},null,null,null,null,null,null,null,1,"Sat"]
[null,null,null,null,null,null,null,null,{"$f":"IF(N5<>'MASTER CONTROLS'!G3,I19+1,\"\")","v":"2022-07-03"},null,null,{"$f":"IF($U20>1,VLOOKUP($U20,'MASTER CONTROLS'!$A$3:$D$11,3,FALSE),\"\")","v":""},{"$f":"IF($U20>1,VLOOKUP($U20,'MASTER CONTROLS'!$A$3:$D$11,4,FALSE),\"\")","v":""},null,null,null,null,null,null,null,1,"Sun"]
[null,null,null,null,null,null,null,null,{"$f":"IF(N5<>'MASTER CONTROLS'!G3,I20+1,\"\")","v":"2022-07-04"},null,null,{"$f":"IF($U21>1,VLOOKUP($U21,'MASTER CONTROLS'!$A$3:$D$11,3,FALSE),\"\")","v":""},{"$f":"IF($U21>1,VLOOKUP($U21,'MASTER CONTROLS'!$A$3:$D$11,4,FALSE),\"\")","v":""},null,null,null,null,null,null,null,1,"Mon"]
[null,null,null,null,null,null,null,null,{"$f":"IF(N5<>'MASTER CONTROLS'!G3,I21+1,\"\")","v":"2022-07-05"},null,null,{"$f":"IF($U22>1,VLOOKUP($U22,'MASTER CONTROLS'!$A$3:$D$11,3,FALSE),\"\")","v":""},{"$f":"IF($U22>1,VLOOKUP($U22,'MASTER CONTROLS'!$A$3:$D$11,4,FALSE),\"\")","v":""},null,null,null,null,null,null,null,1,"Tue"]
[null,null,null,null,null,null,null,null,{"$f":"IF(N5<>'MASTER CONTROLS'!G3,I22+1,\"\")","v":"2022-07-06"},null,null,{"$f":"IF($U23>1,VLOOKUP($U23,'MASTER CONTROLS'!$A$3:$D$11,3,FALSE),\"\")","v":""},{"$f":"IF($U23>1,VLOOKUP($U23,'MASTER CONTROLS'!$A$3:$D$11,4,FALSE),\"\")","v":""},null,null,null,null,null,null,null,1,"Wed"]
[null,null,null,null,null,null,null,null,{"$f":"IF(N5<>'MASTER CONTROLS'!G3,I23+1,\"\")","v":"2022-07-07"},null,null,{"$f":"IF($U24>1,VLOOKUP($U24,'MASTER CONTROLS'!$A$3:$D$11,3,FALSE),\"\")","v":""},{"$f":"IF($U24>1,VLOOKUP($U24,'MASTER CONTROLS'!$A$3:$D$11,4,FALSE),\"\")","v":""},null,null,null,null,null,null,null,1,"Thu"]
[null,null,null,null,null,null,null,null,{"$f":"IF(N5<>'MASTER CONTROLS'!G3,I24+1,\"\")","v":"2022-07-08"},null,null,{"$f":"IF($U25>1,VLOOKUP($U25,'MASTER CONTROLS'!$A$3:$D$11,3,FALSE),\"\")","v":""},{"$f":"IF($U25>1,VLOOKUP($U25,'MASTER CONTROLS'!$A$3:$D$11,4,FALSE),\"\")","v":""},null,null,null,null,null,null,null,1,"Fri"]
[null,null,null,null,null,null,null,null,{"$f":"IF(N5<>'MASTER CONTROLS'!G3,I25+1,\"\")","v":"2022-07-09"},null,null,{"$f":"IF($U26>1,VLOOKUP($U26,'MASTER CONTROLS'!$A$3:$D$11,3,FALSE),\"\")","v":""},{"$f":"IF($U26>1,VLOOKUP($U26,'MASTER CONTROLS'!$A$3:$D$11,4,FALSE),\"\")","v":""},null,null,null,null,null,null,null,1,"Sat"]
[null,null,null,null,null,null,null,null,{"$f":"IF(N5<>'MASTER CONTROLS'!G3,I26+1,\"\")","v":"2022-07-10"},null,null,{"$f":"IF($U27>1,VLOOKUP($U27,'MASTER CONTROLS'!$A$3:$D$11,3,FALSE),\"\")","v":""},{"$f":"IF($U27>1,VLOOKUP($U27,'MASTER CONTROLS'!$A$3:$D$11,4,FALSE),\"\")","v":""},null,null,null,null,null,null,null,1,"Sun"]
[null,null,null,null,null,null,null,null,{"$f":"IF(N5<>'MASTER CONTROLS'!G3,I27+1,\"\")","v":"2022-07-11"},null,null,{"$f":"IF($U28>1,VLOOKUP($U28,'MASTER CONTROLS'!$A$3:$D$11,3,FALSE),\"\")","v":""},{"$f":"IF($U28>1,VLOOKUP($U28,'MASTER CONTROLS'!$A$3:$D$11,4,FALSE),\"\")","v":""},null,null,null,null,null,null,null,1,"Mon"]
[null,null,null,null,null,null,null,null,{"$f":"IF(N5<>'MASTER CONTROLS'!G3,I28+1,\"\")","v":"2022-07-12"},null,null,{"$f":"IF($U29>1,VLOOKUP($U29,'MASTER CONTROLS'!$A$3:$D$11,3,FALSE),\"\")","v":""},{"$f":"IF($U29>1,VLOOKUP($U29,'MASTER CONTROLS'!$A$3:$D$11,4,FALSE),\"\")","v":""},null,null,null,null,null,null,null,1,"Tue"]
[null,null,null,null,null,null,null,null,{"$f":"IF(N5<>'MASTER CONTROLS'!G3,I29+1,\"\")","v":"2022-07-13"},null,null,{"$f":"IF($U30>1,VLOOKUP($U30,'MASTER CONTROLS'!$A$3:$D$11,3,FALSE),\"\")","v":""},{"$f":"IF($U30>1,VLOOKUP($U30,'MASTER CONTROLS'!$A$3:$D$11,4,FALSE),\"\")","v":""},null,null,null,null,null,null,null,1,"Wed"]
[null,null,null,null,null,null,null,null,{"$f":"IF(N5<>'MASTER CONTROLS'!G3,I30+1,\"\")","v":"2022-07-14"},null,null,{"$f":"IF($U31>1,VLOOKUP($U31,'MASTER CONTROLS'!$A$3:$D$11,3,FALSE),\"\")","v":""},{"$f":"IF($U31>1,VLOOKUP($U31,'MASTER CONTROLS'!$A$3:$D$11,4,FALSE),\"\")","v":""},null,null,null,null,null,null,null,1,"Thu"]
[null,null,null,null,null,null,null,null,{"$f":"IF(N5<>'MASTER CONTROLS'!G3,I31+1,\"\")","v":"2022-07-15"},null,null,{"$f":"IF($U32>1,VLOOKUP($U32,'MASTER CONTROLS'!$A$3:$D$11,3,FALSE),\"\")","v":""},{"$f":"IF($U32>1,VLOOKUP($U32,'MASTER CONTROLS'!$A$3:$D$11,4,FALSE),\"\")","v":""},null,null,null,null,null,null,null,1,"Fri"]
[null,null,null,null,null,null,null,null,{"$f":"IF(N5<>'MASTER CONTROLS'!G3,I32+1,\"\")","v":"2022-07-16"},null,null,{"$f":"IF($U33>1,VLOOKUP($U33,'MASTER CONTROLS'!$A$3:$D$11,3,FALSE),\"\")","v":""},{"$f":"IF($U33>1,VLOOKUP($U33,'MASTER CONTROLS'!$A$3:$D$11,4,FALSE),\"\")","v":""},null,null,null,null,null,null,null,1,"Sat"]
[null,null,null,null,null,null,null,null,{"$f":"IF(N5<>'MASTER CONTROLS'!G3,I33+1,\"\")","v":"2022-07-17"},null,null,{"$f":"IF($U34>1,VLOOKUP($U34,'MASTER CONTROLS'!$A$3:$D$11,3,FALSE),\"\")","v":""},{"$f":"IF($U34>1,VLOOKUP($U34,'MASTER CONTROLS'!$A$3:$D$11,4,FALSE),\"\")","v":""},null,null,null,null,null,null,null,1,"Sun"]
[null,null,null,null,null,null,null,null,{"$f":"IF(N5<>'MASTER CONTROLS'!G3,I34+1,\"\")","v":"2022-07-18"},null,null,{"$f":"IF($U35>1,VLOOKUP($U35,'MASTER CONTROLS'!$A$3:$D$11,3,FALSE),\"\")","v":""},{"$f":"IF($U35>1,VLOOKUP($U35,'MASTER CONTROLS'!$A$3:$D$11,4,FALSE),\"\")","v":""},null,null,null,null,null,null,null,1,"Mon"]
[null,null,null,null,null,null,null,null,{"$f":"IF(N5<>'MASTER CONTROLS'!G3,I35+1,\"\")","v":"2022-07-19"},null,null,{"$f":"IF($U36>1,VLOOKUP($U36,'MASTER CONTROLS'!$A$3:$D$11,3,FALSE),\"\")","v":""},{"$f":"IF($U36>1,VLOOKUP($U36,'MASTER CONTROLS'!$A$3:$D$11,4,FALSE),\"\")","v":""},null,null,null,null,null,null,null,1,"Tue"]
[null,null,null,null,null,null,null,null,{"$f":"IF(N5<>'MASTER CONTROLS'!G3,I36+1,\"\")","v":"2022-07-20"},null,null,{"$f":"IF($U37>1,VLOOKUP($U37,'MASTER CONTROLS'!$A$3:$D$11,3,FALSE),\"\")","v":""},{"$f":"IF($U37>1,VLOOKUP($U37,'MASTER CONTROLS'!$A$3:$D$11,4,FALSE),\"\")","v":""},null,null,null,null,null,null,null,1,"Wed"]
[null,null,null,null,null,null,null,null,{"$f":"IF(N5<>'MASTER CONTROLS'!G3,I37+1,\"\")","v":"2022-07-21"},null,null,{"$f":"IF($U38>1,VLOOKUP($U38,'MASTER CONTROLS'!$A$3:$D$11,3,FALSE),\"\")","v":""},{"$f":"IF($U38>1,VLOOKUP($U38,'MASTER CONTROLS'!$A$3:$D$11,4,FALSE),\"\")","v":""},null,null,null,null,null,null,null,1,"Thu"]
[null,null,null,null,null,null,null,null,{"$f":"IF(N5<>'MASTER CONTROLS'!G3,I38+1,\"\")","v":"2022-07-22"},null,null,{"$f":"IF($U39>1,VLOOKUP($U39,'MASTER CONTROLS'!$A$3:$D$11,3,FALSE),\"\")","v":""},{"$f":"IF($U39>1,VLOOKUP($U39,'MASTER CONTROLS'!$A$3:$D$11,4,FALSE),\"\")","v":""},null,null,null,null,null,null,null,1,"Fri"]
[null,null,null,null,null,null,null,null,{"$f":"IF(N5<>'MASTER CONTROLS'!G3,I39+1,\"\")","v":"2022-07-23"},null,null,{"$f":"IF($U40>1,VLOOKUP($U40,'MASTER CONTROLS'!$A$3:$D$11,3,FALSE),\"\")","v":""},{"$f":"IF($U40>1,VLOOKUP($U40,'MASTER CONTROLS'!$A$3:$D$11,4,FALSE),\"\")","v":""},null,null,null,null,null,null,null,1,"Sat"]
[null,null,null,null,null,null,null,null,{"$f":"IF(N5<>'MASTER CONTROLS'!G3,I40+1,\"\")","v":"2022-07-24"},null,null,{"$f":"IF($U41>1,VLOOKUP($U41,'MASTER CONTROLS'!$A$3:$D$11,3,FALSE),\"\")","v":""},{"$f":"IF($U41>1,VLOOKUP($U41,'MASTER CONTROLS'!$A$3:$D$11,4,FALSE),\"\")","v":""},null,null,null,null,null,null,null,1,"Sun"]
[null,null,null,null,null,null,null,null,{"$f":"IF(N5<>'MASTER CONTROLS'!G3,I41+1,\"\")","v":"2022-07-25"},null,null,{"$f":"IF($U42>1,VLOOKUP($U42,'MASTER CONTROLS'!$A$3:$D$11,3,FALSE),\"\")","v":""},{"$f":"IF($U42>1,VLOOKUP($U42,'MASTER CONTROLS'!$A$3:$D$11,4,FALSE),\"\")","v":""},null,null,null,null,null,null,null,1,"Mon"]
[null,null,null,null,null,null,null,null,{"$f":"IF(N5<>'MASTER CONTROLS'!G3,I42+1,\"\")","v":"2022-07-26"},null,null,{"$f":"IF($U43>1,VLOOKUP($U43,'MASTER CONTROLS'!$A$3:$D$11,3,FALSE),\"\")","v":""},{"$f":"IF($U43>1,VLOOKUP($U43,'MASTER CONTROLS'!$A$3:$D$11,4,FALSE),\"\")","v":""},null,null,null,null,null,null,null,1,"Tue"]
[null,null,null,null,null,null,null,null,{"$f":"IF(N5<>'MASTER CONTROLS'!G3,I43+1,\"\")","v":"2022-07-27"},null,null,{"$f":"IF($U44>1,VLOOKUP($U44,'MASTER CONTROLS'!$A$3:$D$11,3,FALSE),\"\")","v":""},{"$f":"IF($U44>1,VLOOKUP($U44,'MASTER CONTROLS'!$A$3:$D$11,4,FALSE),\"\")","v":""},null,null,null,null,null,null,null,1,"Wed"]
[null,null,null,null,null,null,null,null,{"$f":"IF(N5<>'MASTER CONTROLS'!G3,I44+1,\"\")","v":"2022-07-28"},null,null,{"$f":"IF($U45>1,VLOOKUP($U45,'MASTER CONTROLS'!$A$3:$D$11,3,FALSE),\"\")","v":""},{"$f":"IF($U45>1,VLOOKUP($U45,'MASTER CONTROLS'!$A$3:$D$11,4,FALSE),\"\")","v":""},null,null,null,null,null,null,null,1,"Thu"]
[null,null,null,null,null,null,null,null,{"$f":"IF(AND(N$5<>'MASTER CONTROLS'!$G$3,I45<VLOOKUP(N$5,'MASTER CONTROLS'!$G$3:$I$15,3)),I45+1,\"\")","v":"2022-07-29"},null,null,{"$f":"IF($U46>1,VLOOKUP($U46,'MASTER CONTROLS'!$A$3:$D$11,3,FALSE),\"\")","v":""},{"$f":"IF($U46>1,VLOOKUP($U46,'MASTER CONTROLS'!$A$3:$D$11,4,FALSE),\"\")","v":""},null,null,null,null,null,null,null,1,"Fri"]
[null,null,null,null,null,null,null,null,{"$f":"IF(AND(N$5<>'MASTER CONTROLS'!$G$3,I46<VLOOKUP(N$5,'MASTER CONTROLS'!$G$3:$I$15,3)),I46+1,\"\")","v":"2022-07-30"},null,null,{"$f":"IF($U47>1,VLOOKUP($U47,'MASTER CONTROLS'!$A$3:$D$11,3,FALSE),\"\")","v":""},{"$f":"IF($U47>1,VLOOKUP($U47,'MASTER CONTROLS'!$A$3:$D$11,4,FALSE),\"\")","v":""},null,null,null,null,null,null,null,1,"Sat"]
[null,null,null,null,null,null,null,null,{"$f":"IF(AND(N$5<>'MASTER CONTROLS'!$G$3,I47<VLOOKUP(N$5,'MASTER CONTROLS'!$G$3:$I$15,3)),I47+1,\"\")","v":"2022-07-31"},null,null,{"$f":"IF($U48>1,VLOOKUP($U48,'MASTER CONTROLS'!$A$3:$D$11,3,FALSE),\"\")","v":""},{"$f":"IF($U48>1,VLOOKUP($U48,'MASTER CONTROLS'!$A$3:$D$11,4,FALSE),\"\")","v":""},null,null,null,null,null,null,null,1,"Sun"]
["TOTALS",null,null,null,null,null,{"$f":"SUM(G18:H48)","v":0},null,null,null,{"$f":"SUM(K18:K48)","v":0},0,0,0,0,0]
[]
["Office Staff Section",null,null,null,null,null,null,null,null,null,null,null,null,"Phone","Internet","Total"]
[null,null,null,null,null,null,null,null,null,null,null,null,null,null,null,{"$f":"SUM(N52:O52)","v":0}]
[]
["Pastor's Section",null,null,null,null,null,null,null,{"$f":"Jan!I54","v":"Profession of Faith"},null,null,"Worship Service Attendance"]
[{"$f":"Jan!A55","v":"Church Name "},null,null,null,null,null,null,"Baptisms",null,null,"Transfers","Week 1","Week 2","Week 3","Week 4","Week 5"]
[null,null,null,null,null,null,null,null,null,null,null,null,null,null,null,null,{"$f":"COUNTIF(V18:V48,\"Sat\")","v":5},{"$f":"COUNT(G56:P56)","v":0}]
[]
[]
[]
[]
["Comments & Notes"]
[]
[null,null,null,null,null,null,null,null,null,null,null,null,null,null,null,null,null,null,null,null,false]
[]
["OFFICE USE ONLY"]
["10200) Travel Budget",null,null,null,null,null,"10201) Per Diem Tx",null,null,null,null,null,"11206) Travel Misc"]
["11211) Non-Tax Miles",null,null,null,null,null,"11201) Per Diem NTx",null,null,null,null,null,"11230) Conv./Mtgs"]
["11200) Special Miles",null,null,null,null,null,"11202) Lodging",null,null,null,null,null,"11403) Phone"]
["10212) Spouse Travel",null,null,null,null,null,"11203) Car Rental",null,null,null,null,null,"10408) Internet"]
["11405) Entertainment",null,null,null,null,null,"11209) Airfare Travel"]

{"sheet":"Aug","index":8,"n_rows":70,"n_cols":22,"rows_kept":70,"cut":false,"hidden":false,"merged":[[19,6,19,7],[18,6,18,7],[17,6,17,7],[10,6,10,7],[29,6,29,7],[28,6,28,7],[27,6,27,7],[26,6,26,7],[25,6,25,7],[24,6,24,7],[23,6,23,7],[22,6,22,7],[21,6,21,7],[44,6,44,7],[43,6,43,7],[42,6,42,7],[41,6,41,7],[40,6,40,7],[67,0,67,2],[69,0,69,1],[69,6,69,7],[20,6,20,7],[38,6,38,7],[37,6,37,7],[36,6,36,7],[35,6,35,7],[34,6,34,7],[33,6,33,7],[32,6,32,7],[39,8,39,9],[46,8,46,9],[26,8,26,9],[31,1,31,5],[32,1,32,5],[34,8,34,9],[33,8,33,9],[30,8,30,9],[38,8,38,9],[42,8,42,9],[44,1,44,5],[43,1,43,5],[34,1,34,5],[36,1,36,5],[35,1,35,5],[39,1,39,5],[40,1,40,5],[36,8,36,9],[37,8,37,9],[41,8,41,9],[29,8,29,9],[31,6,31,7],[30,6,30,7],[46,6,46,7],[69,12,69,13],[68,14,68,15],[65,14,65,15],[66,14,66,15],[67,14,67,15],[65,12,65,13],[0,0,0,15],[37,1,37,5],[38,1,38,5],[9,1,9,5],[10,1,10,5],[17,1,17,5],[9,14,10,15],[9,6,9,7],[35,8,35,9],[1,0,1,15],[8,10,8,12],[3,1,3,9],[7,5,7,10],[4,1,4,9],[5,1,5,9],[19,1,19,5],[19,8,19,9],[8,0,8,9],[68,12,68,13],[66,0,66,2],[67,6,67,8],[68,6,68,8],[47,1,47,5],[59,0,59,2],[68,3,68,4],[68,0,68,2],[55,0,55,6],[56,0,56,6],[59,6,59,8],[57,0,57,6],[64,0,64,15],[66,6,66,8],[59,9,59,10],[50,0,50,2],[54,0,54,5],[60,2,61,15],[59,11,59,12],[47,8,47,9],[56,8,56,9],[55,8,55,9],[48,6,48,7],[47,6,47,7],[18,8,18,9],[3,16,3,19],[4,16,6,19],[7,16,7,19],[6,0,6,9],[7,1,7,3],[9,11,9,12],[4,13,4,15],[5,13,5,15],[6,13,8,15],[18,1,18,5],[9,8,10,9],[17,8,17,9],[21,8,21,9],[40,8,40,9],[31,8,31,9],[32,8,32,9],[20,8,20,9],[24,8,24,9],[25,1,25,5],[22,1,22,5],[27,8,27,9],[23,8,23,9],[21,1,21,5],[25,8,25,9],[22,8,22,9],[20,1,20,5],[24,1,24,5],[27,1,27,5],[23,1,23,5],[29,1,29,5],[30,1,30,5],[28,1,28,5],[28,8,28,9],[33,1,33,5],[26,1,26,5],[39,6,39,7],[45,1,45,5],[48,0,48,5],[67,12,67,13],[66,12,66,13],[41,1,41,5],[46,1,46,5],[65,3,65,4],[65,0,65,2],[65,6,65,8],[66,3,66,4],[53,0,53,1],[48,8,48,9],[53,8,54,9],[51,0,51,12],[53,11,53,15],[67,3,67,4],[42,1,42,5],[60,0,61,1],[59,13,59,14],[57,8,57,9],[44,8,44,9],[43,8,43,9],[45,8,45,9],[45,6,45,7]]}
[{"$f":"\"Northern California Conference Expense Report\" & IF($U$63=TRUE,\" (REVISED)\",\"\")","v":"Northern California Conference Expense Report"}]
[{"$f":"Jan!A2","v":"Email to: payroll@nccsda.com      "},null,null,null,null,null,null,null,null,null,null,null,null,null,null,null,null,null,null,null,false]
[]
["Name",{"$f":"IF(Jan!B4<>\"\",Jan!B4,\"\")","v":""},null,null,null,null,null,null,null,null,null,null,null,null,null,null,"Per Diem Note:"]
["Address",{"$f":"IF(Jul!B5<>\"\",Jul!B5,\"\")","v":""},null,null,{"$f":"IF(Jan!E5<>\"\",Jan!E5,\"\")","v":""},null,null,{"$f":"IF(Jan!H5<>\"\",Jan!H5,\"\")","v":""},null,null,null,null,null,{"$f":"'MASTER CONTROLS'!G11","v":"2022-08-01"},null,null,"1) If you are away from home and have an overnight stay on either side of a day you qualify for per diem, choose an option with NT."]
[null,{"$f":"IF(Jul!B6<>\"\",Jul!B6,\"\")","v":""},null,null,{"$f":"IF(Jan!E6<>\"\",Jan!E6,\"\")","v":""},null,null,{"$f":"IF(Jan!H6<>\"\",Jan!H6,\"\")","v":""},null,null,null,null,null,{"$f":" IF(N5<>'MASTER CONTROLS'!G3,\"Due \" & TEXT(DATE(1,MONTH(I18)+1,1),\"mmmm\") & \" 3rd.\",\"\")","v":"Due September 3rd."}]
["Best way to contact:",null,null,null,null,null,null,null,null,null,null,null,null,"*Reimbursements are made for completed reports including original receipts with travel approval from ADCO or assigned job duties. Lodging must be documented with a folio."]
["Phone:",{"$f":"IF(Jul!B8<>\"\",Jul!B8,\"\")","v":""},null,null,"Email:",{"$f":"IF(Jul!F8<>\"\",Jul!F8,\"\")","v":""},null,null,{"$f":"IF(Jan!I8<>\"\",Jan!I8,\"\")","v":""},null,null,null,null,null,null,null,{"$f":"Jan!Q8","v":"2) Per diem for events that do not include an overnight stay are taxable. Spousal per diems are always taxable."}]
[{"$f":"Jan!A9","v":"Please log in to APS Employee online to update your address and phone number."},null,null,null,null,null,null,null,null,null,"** ADCO must approve Special Mileage."]
["Short","Daily Activity Description",null,null,null,null,null,null,"Date",null,"Special","Per Diem",null,null,"Air/Car/Gas/Transit    Other",null,null,"PD Tx","PD NTx","Per Diem","Ans: Per"]
["Description","Example: Visitation, Sermon Prep, etc.",null,null,null,null,"Budgeted Mileage",null,null,null,"Mileage**","Taxable","Non-Tax","Lodging*",null,null,null,{"$f":"$L$49","v":0},{"$f":"$M$49","v":0},"Totals","Diem"]
[]
["Worked"]
["Day Off"]
["Vacation"]
["Sick Day"]
["Holiday"]
[null,null,null,null,null,null,null,null,{"$f":"IF(N5<>'MASTER CONTROLS'!G3,N5,\"\")","v":"2022-08-01"},null,null,{"$f":"IF($U18>1,VLOOKUP($U18,'MASTER CONTROLS'!$A$3:$D$11,3,FALSE),\"\")","v":""},{"$f":"IF($U18>1,VLOOKUP($U18,'MASTER CONTROLS'!$A$3:$D$11,4,FALSE),\"\")","v":""},null,null,null,null,null,null,null,1,{"$f":"TEXT(I18,\"ddd\")","v":"Mon"}]
[null,null,null,null,null,null,null,null,{"$f":"IF(N5<>'MASTER CONTROLS'!G3,I18+1,\"\")","v":"2022-08-02"},null,null,{"$f":"IF($U19>1,VLOOKUP($U19,'MASTER CONTROLS'!$A$3:$D$11,3,FALSE),\"\")","v":""},{"$f":"IF($U19>1,VLOOKUP($U19,'MASTER CONTROLS'!$A$3:$D$11,4,FALSE),\"\")","v":""},null,null,null,null,null,null,null,1,"Tue"]
[null,null,null,null,null,null,null,null,{"$f":"IF(N5<>'MASTER CONTROLS'!G3,I19+1,\"\")","v":"2022-08-03"},null,null,{"$f":"IF($U20>1,VLOOKUP($U20,'MASTER CONTROLS'!$A$3:$D$11,3,FALSE),\"\")","v":""},{"$f":"IF($U20>1,VLOOKUP($U20,'MASTER CONTROLS'!$A$3:$D$11,4,FALSE),\"\")","v":""},null,null,null,null,null,null,null,1,"Wed"]
[null,null,null,null,null,null,null,null,{"$f":"IF(N5<>'MASTER CONTROLS'!G3,I20+1,\"\")","v":"2022-08-04"},null,null,{"$f":"IF($U21>1,VLOOKUP($U21,'MASTER CONTROLS'!$A$3:$D$11,3,FALSE),\"\")","v":""},{"$f":"IF($U21>1,VLOOKUP($U21,'MASTER CONTROLS'!$A$3:$D$11,4,FALSE),\"\")","v":""},null,null,null,null,null,null,null,1,"Thu"]
[null,null,null,null,null,null,null,null,{"$f":"IF(N5<>'MASTER CONTROLS'!G3,I21+1,\"\")","v":"2022-08-05"},null,null,{"$f":"IF($U22>1,VLOOKUP($U22,'MASTER CONTROLS'!$A$3:$D$11,3,FALSE),\"\")","v":""},{"$f":"IF($U22>1,VLOOKUP($U22,'MASTER CONTROLS'!$A$3:$D$11,4,FALSE),\"\")","v":""},null,null,null,null,null,null,null,1,"Fri"]
[null,null,null,null,null,null,null,null,{"$f":"IF(N5<>'MASTER CONTROLS'!G3,I22+1,\"\")","v":"2022-08-06"},null,null,{"$f":"IF($U23>1,VLOOKUP($U23,'MASTER CONTROLS'!$A$3:$D$11,3,FALSE),\"\")","v":""},{"$f":"IF($U23>1,VLOOKUP($U23,'MASTER CONTROLS'!$A$3:$D$11,4,FALSE),\"\")","v":""},null,null,null,null,null,null,null,1,"Sat"]
[null,null,null,null,null,null,null,null,{"$f":"IF(N5<>'MASTER CONTROLS'!G3,I23+1,\"\")","v":"2022-08-07"},null,null,{"$f":"IF($U24>1,VLOOKUP($U24,'MASTER CONTROLS'!$A$3:$D$11,3,FALSE),\"\")","v":""},{"$f":"IF($U24>1,VLOOKUP($U24,'MASTER CONTROLS'!$A$3:$D$11,4,FALSE),\"\")","v":""},null,null,null,null,null,null,null,1,"Sun"]
[null,null,null,null,null,null,null,null,{"$f":"IF(N5<>'MASTER CONTROLS'!G3,I24+1,\"\")","v":"2022-08-08"},null,null,{"$f":"IF($U25>1,VLOOKUP($U25,'MASTER CONTROLS'!$A$3:$D$11,3,FALSE),\"\")","v":""},{"$f":"IF($U25>1,VLOOKUP($U25,'MASTER CONTROLS'!$A$3:$D$11,4,FALSE),\"\")","v":""},null,null,null,null,null,null,null,1,"Mon"]
[null,null,null,null,null,null,null,null,{"$f":"IF(N5<>'MASTER CONTROLS'!G3,I25+1,\"\")","v":"2022-08-09"},null,null,{"$f":"IF($U26>1,VLOOKUP($U26,'MASTER CONTROLS'!$A$3:$D$11,3,FALSE),\"\")","v":""},{"$f":"IF($U26>1,VLOOKUP($U26,'MASTER CONTROLS'!$A$3:$D$11,4,FALSE),\"\")","v":""},null,null,null,null,null,null,null,1,"Tue"]
[null,null,null,null,null,null,null,null,{"$f":"IF(N5<>'MASTER CONTROLS'!G3,I26+1,\"\")","v":"2022-08-10"},null,null,{"$f":"IF($U27>1,VLOOKUP($U27,'MASTER CONTROLS'!$A$3:$D$11,3,FALSE),\"\")","v":""},{"$f":"IF($U27>1,VLOOKUP($U27,'MASTER CONTROLS'!$A$3:$D$11,4,FALSE),\"\")","v":""},null,null,null,null,null,null,null,1,"Wed"]
[null,null,null,null,null,null,null,null,{"$f":"IF(N5<>'MASTER CONTROLS'!G3,I27+1,\"\")","v":"2022-08-11"},null,null,{"$f":"IF($U28>1,VLOOKUP($U28,'MASTER CONTROLS'!$A$3:$D$11,3,FALSE),\"\")","v":""},{"$f":"IF($U28>1,VLOOKUP($U28,'MASTER CONTROLS'!$A$3:$D$11,4,FALSE),\"\")","v":""},null,null,null,null,null,null,null,1,"Thu"]
[null,null,null,null,null,null,null,null,{"$f":"IF(N5<>'MASTER CONTROLS'!G3,I28+1,\"\")","v":"2022-08-12"},null,null,{"$f":"IF($U29>1,VLOOKUP($U29,'MASTER CONTROLS'!$A$3:$D$11,3,FALSE),\"\")","v":""},{"$f":"IF($U29>1,VLOOKUP($U29,'MASTER CONTROLS'!$A$3:$D$11,4,FALSE),\"\")","v":""},null,null,null,null,null,null,null,1,"Fri"]
[null,null,null,null,null,null,null,null,{"$f":"IF(N5<>'MASTER CONTROLS'!G3,I29+1,\"\")","v":"2022-08-13"},null,null,{"$f":"IF($U30>1,VLOOKUP($U30,'MASTER CONTROLS'!$A$3:$D$11,3,FALSE),\"\")","v":""},{"$f":"IF($U30>1,VLOOKUP($U30,'MASTER CONTROLS'!$A$3:$D$11,4,FALSE),\"\")","v":""},null,null,null,null,null,null,null,1,"Sat"]
[null,null,null,null,null,null,null,null,{"$f":"IF(N5<>'MASTER CONTROLS'!G3,I30+1,\"\")","v":"2022-08-14"},null,null,{"$f":"IF($U31>1,VLOOKUP($U31,'MASTER CONTROLS'!$A$3:$D$11,3,FALSE),\"\")","v":""},{"$f":"IF($U31>1,VLOOKUP($U31,'MASTER CONTROLS'!$A$3:$D$11,4,FALSE),\"\")","v":""},null,null,null,null,null,null,null,1,"Sun"]
[null,null,null,null,null,null,null,null,{"$f":"IF(N5<>'MASTER CONTROLS'!G3,I31+1,\"\")","v":"2022-08-15"},null,null,{"$f":"IF($U32>1,VLOOKUP($U32,'MASTER CONTROLS'!$A$3:$D$11,3,FALSE),\"\")","v":""},{"$f":"IF($U32>1,VLOOKUP($U32,'MASTER CONTROLS'!$A$3:$D$11,4,FALSE),\"\")","v":""},null,null,null,null,null,null,null,1,"Mon"]
[null,null,null,null,null,null,null,null,{"$f":"IF(N5<>'MASTER CONTROLS'!G3,I32+1,\"\")","v":"2022-08-16"},null,null,{"$f":"IF($U33>1,VLOOKUP($U33,'MASTER CONTROLS'!$A$3:$D$11,3,FALSE),\"\")","v":""},{"$f":"IF($U33>1,VLOOKUP($U33,'MASTER CONTROLS'!$A$3:$D$11,4,FALSE),\"\")","v":""},null,null,null,null,null,null,null,1,"Tue"]
[null,null,null,null,null,null,null,null,{"$f":"IF(N5<>'MASTER CONTROLS'!G3,I33+1,\"\")","v":"2022-08-17"},null,null,{"$f":"IF($U34>1,VLOOKUP($U34,'MASTER CONTROLS'!$A$3:$D$11,3,FALSE),\"\")","v":""},{"$f":"IF($U34>1,VLOOKUP($U34,'MASTER CONTROLS'!$A$3:$D$11,4,FALSE),\"\")","v":""},null,null,null,null,null,null,null,1,"Wed"]
[null,null,null,null,null,null,null,null,{"$f":"IF(N5<>'MASTER CONTROLS'!G3,I34+1,\"\")","v":"2022-08-18"},null,null,{"$f":"IF($U35>1,VLOOKUP($U35,'MASTER CONTROLS'!$A$3:$D$11,3,FALSE),\"\")","v":""},{"$f":"IF($U35>1,VLOOKUP($U35,'MASTER CONTROLS'!$A$3:$D$11,4,FALSE),\"\")","v":""},null,null,null,null,null,null,null,1,"Thu"]
[null,null,null,null,null,null,null,null,{"$f":"IF(N5<>'MASTER CONTROLS'!G3,I35+1,\"\")","v":"2022-08-19"},null,null,{"$f":"IF($U36>1,VLOOKUP($U36,'MASTER CONTROLS'!$A$3:$D$11,3,FALSE),\"\")","v":""},{"$f":"IF($U36>1,VLOOKUP($U36,'MASTER CONTROLS'!$A$3:$D$11,4,FALSE),\"\")","v":""},null,null,null,null,null,null,null,1,"Fri"]
[null,null,null,null,null,null,null,null,{"$f":"IF(N5<>'MASTER CONTROLS'!G3,I36+1,\"\")","v":"2022-08-20"},null,null,{"$f":"IF($U37>1,VLOOKUP($U37,'MASTER CONTROLS'!$A$3:$D$11,3,FALSE),\"\")","v":""},{"$f":"IF($U37>1,VLOOKUP($U37,'MASTER CONTROLS'!$A$3:$D$11,4,FALSE),\"\")","v":""},null,null,null,null,null,null,null,1,"Sat"]
[null,null,null,null,null,null,null,null,{"$f":"IF(N5<>'MASTER CONTROLS'!G3,I37+1,\"\")","v":"2022-08-21"},null,null,{"$f":"IF($U38>1,VLOOKUP($U38,'MASTER CONTROLS'!$A$3:$D$11,3,FALSE),\"\")","v":""},{"$f":"IF($U38>1,VLOOKUP($U38,'MASTER CONTROLS'!$A$3:$D$11,4,FALSE),\"\")","v":""},null,null,null,null,null,null,null,1,"Sun"]
[null,null,null,null,null,null,null,null,{"$f":"IF(N5<>'MASTER CONTROLS'!G3,I38+1,\"\")","v":"2022-08-22"},null,null,{"$f":"IF($U39>1,VLOOKUP($U39,'MASTER CONTROLS'!$A$3:$D$11,3,FALSE),\"\")","v":""},{"$f":"IF($U39>1,VLOOKUP($U39,'MASTER CONTROLS'!$A$3:$D$11,4,FALSE),\"\")","v":""},null,null,null,null,null,null,null,1,"Mon"]
[null,null,null,null,null,null,null,null,{"$f":"IF(N5<>'MASTER CONTROLS'!G3,I39+1,\"\")","v":"2022-08-23"},null,null,{"$f":"IF($U40>1,VLOOKUP($U40,'MASTER CONTROLS'!$A$3:$D$11,3,FALSE),\"\")","v":""},{"$f":"IF($U40>1,VLOOKUP($U40,'MASTER CONTROLS'!$A$3:$D$11,4,FALSE),\"\")","v":""},null,null,null,null,null,null,null,1,"Tue"]
[null,null,null,null,null,null,null,null,{"$f":"IF(N5<>'MASTER CONTROLS'!G3,I40+1,\"\")","v":"2022-08-24"},null,null,{"$f":"IF($U41>1,VLOOKUP($U41,'MASTER CONTROLS'!$A$3:$D$11,3,FALSE),\"\")","v":""},{"$f":"IF($U41>1,VLOOKUP($U41,'MASTER CONTROLS'!$A$3:$D$11,4,FALSE),\"\")","v":""},null,null,null,null,null,null,null,1,"Wed"]
[null,null,null,null,null,null,null,null,{"$f":"IF(N5<>'MASTER CONTROLS'!G3,I41+1,\"\")","v":"2022-08-25"},null,null,{"$f":"IF($U42>1,VLOOKUP($U42,'MASTER CONTROLS'!$A$3:$D$11,3,FALSE),\"\")","v":""},{"$f":"IF($U42>1,VLOOKUP($U42,'MASTER CONTROLS'!$A$3:$D$11,4,FALSE),\"\")","v":""},null,null,null,null,null,null,null,1,"Thu"]
[null,null,null,null,null,null,null,null,{"$f":"IF(N5<>'MASTER CONTROLS'!G3,I42+1,\"\")","v":"2022-08-26"},null,null,{"$f":"IF($U43>1,VLOOKUP($U43,'MASTER CONTROLS'!$A$3:$D$11,3,FALSE),\"\")","v":""},{"$f":"IF($U43>1,VLOOKUP($U43,'MASTER CONTROLS'!$A$3:$D$11,4,FALSE),\"\")","v":""},null,null,null,null,null,null,null,1,"Fri"]
[null,null,null,null,null,null,null,null,{"$f":"IF(N5<>'MASTER CONTROLS'!G3,I43+1,\"\")","v":"2022-08-27"},null,null,{"$f":"IF($U44>1,VLOOKUP($U44,'MASTER CONTROLS'!$A$3:$D$11,3,FALSE),\"\")","v":""},{"$f":"IF($U44>1,VLOOKUP($U44,'MASTER CONTROLS'!$A$3:$D$11,4,FALSE),\"\")","v":""},null,null,null,null,null,null,null,1,"Sat"]
[null,null,null,null,null,null,null,null,{"$f":"IF(N5<>'MASTER CONTROLS'!G3,I44+1,\"\")","v":"2022-08-28"},null,null,{"$f":"IF($U45>1,VLOOKUP($U45,'MASTER CONTROLS'!$A$3:$D$11,3,FALSE),\"\")","v":""},{"$f":"IF($U45>1,VLOOKUP($U45,'MASTER CONTROLS'!$A$3:$D$11,4,FALSE),\"\")","v":""},null,null,null,null,null,null,null,1,"Sun"]
[null,null,null,null,null,null,null,null,{"$f":"IF(AND(N$5<>'MASTER CONTROLS'!$G$3,I45<VLOOKUP(N$5,'MASTER CONTROLS'!$G$3:$I$15,3)),I45+1,\"\")","v":"2022-08-29"},null,null,{"$f":"IF($U46>1,VLOOKUP($U46,'MASTER CONTROLS'!$A$3:$D$11,3,FALSE),\"\")","v":""},{"$f":"IF($U46>1,VLOOKUP($U46,'MASTER CONTROLS'!$A$3:$D$11,4,FALSE),\"\")","v":""},null,null,null,null,null,null,null,1,"Mon"]
[null,null,null,null,null,null,null,null,{"$f":"IF(AND(N$5<>'MASTER CONTROLS'!$G$3,I46<VLOOKUP(N$5,'MASTER CONTROLS'!$G$3:$I$15,3)),I46+1,\"\")","v":"2022-08-30"},null,null,{"$f":"IF($U47>1,VLOOKUP($U47,'MASTER CONTROLS'!$A$3:$D$11,3,FALSE),\"\")","v":""},{"$f":"IF($U47>1,VLOOKUP($U47,'MASTER CONTROLS'!$A$3:$D$11,4,FALSE),\"\")","v":""},null,null,null,null,null,null,null,1,"Tue"]
[null,null,null,null,null,null,null,null,{"$f":"IF(AND(N$5<>'MASTER CONTROLS'!$G$3,I47<VLOOKUP(N$5,'MASTER CONTROLS'!$G$3:$I$15,3)),I47+1,\"\")","v":"2022-08-31"},null,null,{"$f":"IF($U48>1,VLOOKUP($U48,'MASTER CONTROLS'!$A$3:$D$11,3,FALSE),\"\")","v":""},{"$f":"IF($U48>1,VLOOKUP($U48,'MASTER CONTROLS'!$A$3:$D$11,4,FALSE),\"\")","v":""},null,null,null,null,null,null,null,1,"Wed"]
["TOTALS",null,null,null,null,null,{"$f":"SUM(G18:H48)","v":0},null,null,null,{"$f":"SUM(K18:K48)","v":0},0,0,0,0,0]
[]
["Office Staff Section",null,null,null,null,null,null,null,null,null,null,null,null,"Phone","Internet","Total"]
[null,null,null,null,null,null,null,null,null,null,null,null,null,null,null,{"$f":"SUM(N52:O52)","v":0}]
[]
["Pastor's Section",null,null,null,null,null,null,null,{"$f":"Jan!I54","v":"Profession of Faith"},null,null,"Worship Service Attendance"]
[{"$f":"Jan!A55","v":"Church Name "},null,null,null,null,null,null,"Baptisms",null,null,"Transfers","Week 1","Week 2","Week 3","Week 4","Week 5"]
[null,null,null,null,null,null,null,null,null,null,null,null,null,null,null,null,{"$f":"COUNTIF(V18:V48,\"Sat\")","v":4},{"$f":"COUNT(G56:P56)","v":0}]
[]
[]
[]
[]
["Comments & Notes"]
[]
[null,null,null,null,null,null,null,null,null,null,null,null,null,null,null,null,null,null,null,null,false]
[]
["OFFICE USE ONLY"]
["10200) Travel Budget",null,null,null,null,null,"10201) Per Diem Tx",null,null,null,null,null,"11206) Travel Misc"]
["11211) Non-Tax Miles",null,null,null,null,null,"11201) Per Diem NTx",null,null,null,null,null,"11230) Conv./Mtgs"]
["11200) Special Miles",null,null,null,null,null,"11202) Lodging",null,null,null,null,null,"11403) Phone"]
["10212) Spouse Travel",null,null,null,null,null,"11203) Car Rental",null,null,null,null,null,"10408) Internet"]
["11405) Entertainment",null,null,null,null,null,"11209) Airfare Travel"]

{"sheet":"Sep","index":9,"n_rows":70,"n_cols":22,"rows_kept":70,"cut":false,"hidden":false,"merged":[[69,0,69,1],[69,6,69,7],[21,6,21,7],[20,6,20,7],[19,6,19,7],[18,6,18,7],[17,6,17,7],[10,6,10,7],[30,6,30,7],[29,6,29,7],[28,6,28,7],[27,6,27,7],[26,6,26,7],[25,6,25,7],[24,6,24,7],[23,6,23,7],[22,6,22,7],[46,6,46,7],[45,6,45,7],[44,6,44,7],[43,6,43,7],[42,6,42,7],[41,6,41,7],[18,1,18,5],[4,13,4,15],[5,13,5,15],[6,13,8,15],[8,0,8,9],[8,10,8,12],[3,1,3,9],[7,5,7,10],[4,1,4,9],[5,1,5,9],[17,1,17,5],[9,14,10,15],[17,8,17,9],[3,16,3,19],[4,16,6,19],[7,16,7,19],[6,0,6,9],[7,1,7,3],[9,11,9,12],[9,8,10,9],[69,12,69,13],[41,1,41,5],[46,1,46,5],[47,1,47,5],[42,1,42,5],[44,1,44,5],[67,6,67,8],[64,0,64,15],[66,3,66,4],[67,3,67,4],[68,12,68,13],[66,0,66,2],[67,12,67,13],[66,12,66,13],[44,8,44,9],[68,14,68,15],[59,0,59,2],[68,3,68,4],[47,8,47,9],[56,8,56,9],[59,6,59,8],[57,0,57,6],[65,6,65,8],[65,14,65,15],[0,0,0,15],[37,1,37,5],[38,1,38,5],[9,1,9,5],[10,1,10,5],[9,6,9,7],[36,1,36,5],[35,1,35,5],[19,8,19,9],[21,8,21,9],[22,1,22,5],[24,1,24,5],[26,1,26,5],[25,1,25,5],[28,1,28,5],[31,1,31,5],[32,1,32,5],[31,8,31,9],[32,8,32,9],[20,8,20,9],[22,8,22,9],[24,8,24,9],[18,8,18,9],[1,0,1,15],[19,1,19,5],[20,1,20,5],[21,1,21,5],[36,8,36,9],[25,8,25,9],[29,1,29,5],[30,1,30,5],[37,8,37,9],[35,8,35,9],[26,8,26,9],[23,8,23,9],[28,8,28,9],[27,1,27,5],[23,1,23,5],[27,8,27,9],[30,8,30,9],[37,6,37,7],[36,6,36,7],[35,6,35,7],[34,6,34,7],[33,6,33,7],[32,6,32,7],[31,6,31,7],[29,8,29,9],[39,8,39,9],[40,1,40,5],[43,1,43,5],[34,1,34,5],[33,8,33,9],[38,8,38,9],[40,8,40,9],[33,1,33,5],[43,8,43,9],[34,8,34,9],[42,8,42,9],[41,8,41,9],[39,1,39,5],[40,6,40,7],[39,6,39,7],[38,6,38,7],[47,6,47,7],[46,8,46,9],[66,6,66,8],[45,8,45,9],[60,0,61,1],[54,0,54,5],[45,1,45,5],[55,8,55,9],[57,8,57,9],[68,0,68,2],[53,0,53,1],[48,8,48,9],[53,8,54,9],[51,0,51,12],[50,0,50,2],[53,11,53,15],[65,12,65,13],[59,9,59,10],[68,6,68,8],[60,2,61,15],[59,11,59,12],[66,14,66,15],[67,14,67,15],[65,0,65,2],[59,13,59,14],[48,0,48,5],[65,3,65,4],[55,0,55,6],[56,0,56,6],[48,6,48,7],[67,0,67,2]]}
[{"$f":"\"Northern California Conference Expense Report\" & IF($U$63=TRUE,\" (REVISED)\",\"\")","v":"Northern California Conference Expense Report"}]
[{"$f":"Jan!A2","v":"Email to: payroll@nccsda.com      "},null,null,null,null,null,null,null,null,null,null,null,null,null,null,null,null,null,null,null,false]
[]
["Name",{"$f":"IF(Aug!B4<>\"\",Aug!B4,\"\")","v":""},null,null,null,null,null,null,null,null,null,null,null,null,null,null,"Per Diem Note:"]
["Address",{"$f":"IF(Aug!B5<>\"\",Aug!B5,\"\")","v":""},null,null,null,null,null,null,null,null,null,null,null,{"$f":"'MASTER CONTROLS'!G12","v":"2022-09-01"},null,null,"1) If you are away from home and have an overnight stay on either side of a day you qualify for per diem, choose an option with NT."]
[null,{"$f":"IF(Aug!B6<>\"\",Aug!B6,\"\")","v":""},null,null,null,null,null,null,null,null,null,null,null,{"$f":" IF(N5<>'MASTER CONTROLS'!G3,\"Due \" & TEXT(DATE(1,MONTH(I18)+1,1),\"mmmm\") & \" 3rd.\",\"\")","v":"Due October 3rd."}]
["Best way to contact:",null,null,null,null,null,null,null,null,null,null,null,null,"*Reimbursements are made for completed reports including original receipts with travel approval from ADCO or assigned job duties. Lodging must be documented with a folio."]
["Phone:",{"$f":"IF(Aug!B8<>\"\",Aug!B8,\"\")","v":""},null,null,"Email:",{"$f":"IF(Aug!F8<>\"\",Aug!F8,\"\")","v":""},null,null,null,null,null,null,null,null,null,null,{"$f":"Jan!Q8","v":"2) Per diem for events that do not include an overnight stay are taxable. Spousal per diems are always taxable."}]
[{"$f":"Jan!A9","v":"Please log in to APS Employee online to update your address and phone number."},null,null,null,null,null,null,null,null,null,"** ADCO must approve Special Mileage."]
["Short","Daily Activity Description",null,null,null,null,null,null,"Date",null,"Special","Per Diem",null,null,"Air/Car/Gas/Transit    Other",null,null,"PD Tx","PD NTx","Per Diem","Ans: Per"]
["Description","Example: Visitation, Sermon Prep, etc.",null,null,null,null,"Budgeted Mileage",null,null,null,"Mileage**","Taxable","Non-Tax","Lodging*",null,null,null,{"$f":"$L$49","v":0},{"$f":"$M$49","v":0},"Totals","Diem"]
[]
["Worked"]
["Day Off"]
["Vacation"]
["Sick Day"]
["Holiday"]
[null,null,null,null,null,null,null,null,{"$f":"IF(N5<>'MASTER CONTROLS'!G3,N5,\"\")","v":"2022-09-01"},null,null,{"$f":"IF($U18>1,VLOOKUP($U18,'MASTER CONTROLS'!$A$3:$D$11,3,FALSE),\"\")","v":""},{"$f":"IF($U18>1,VLOOKUP($U18,'MASTER CONTROLS'!$A$3:$D$11,4,FALSE),\"\")","v":""},null,null,null,null,null,null,null,1,{"$f":"TEXT(I18,\"ddd\")","v":"Thu"}]
[null,null,null,null,null,null,null,null,{"$f":"IF(N5<>'MASTER CONTROLS'!G3,I18+1,\"\")","v":"2022-09-02"},null,null,{"$f":"IF($U19>1,VLOOKUP($U19,'MASTER CONTROLS'!$A$3:$D$11,3,FALSE),\"\")","v":""},{"$f":"IF($U19>1,VLOOKUP($U19,'MASTER CONTROLS'!$A$3:$D$11,4,FALSE),\"\")","v":""},null,null,null,null,null,null,null,1,"Fri"]
[null,null,null,null,null,null,null,null,{"$f":"IF(N5<>'MASTER CONTROLS'!G3,I19+1,\"\")","v":"2022-09-03"},null,null,{"$f":"IF($U20>1,VLOOKUP($U20,'MASTER CONTROLS'!$A$3:$D$11,3,FALSE),\"\")","v":""},{"$f":"IF($U20>1,VLOOKUP($U20,'MASTER CONTROLS'!$A$3:$D$11,4,FALSE),\"\")","v":""},null,null,null,null,null,null,null,1,"Sat"]
[null,null,null,null,null,null,null,null,{"$f":"IF(N5<>'MASTER CONTROLS'!G3,I20+1,\"\")","v":"2022-09-04"},null,null,{"$f":"IF($U21>1,VLOOKUP($U21,'MASTER CONTROLS'!$A$3:$D$11,3,FALSE),\"\")","v":""},{"$f":"IF($U21>1,VLOOKUP($U21,'MASTER CONTROLS'!$A$3:$D$11,4,FALSE),\"\")","v":""},null,null,null,null,null,null,null,1,"Sun"]
[null,null,null,null,null,null,null,null,{"$f":"IF(N5<>'MASTER CONTROLS'!G3,I21+1,\"\")","v":"2022-09-05"},null,null,{"$f":"IF($U22>1,VLOOKUP($U22,'MASTER CONTROLS'!$A$3:$D$11,3,FALSE),\"\")","v":""},{"$f":"IF($U22>1,VLOOKUP($U22,'MASTER CONTROLS'!$A$3:$D$11,4,FALSE),\"\")","v":""},null,null,null,null,null,null,null,1,"Mon"]
[null,null,null,null,null,null,null,null,{"$f":"IF(N5<>'MASTER CONTROLS'!G3,I22+1,\"\")","v":"2022-09-06"},null,null,{"$f":"IF($U23>1,VLOOKUP($U23,'MASTER CONTROLS'!$A$3:$D$11,3,FALSE),\"\")","v":""},{"$f":"IF($U23>1,VLOOKUP($U23,'MASTER CONTROLS'!$A$3:$D$11,4,FALSE),\"\")","v":""},null,null,null,null,null,null,null,1,"Tue"]
[null,null,null,null,null,null,null,null,{"$f":"IF(N5<>'MASTER CONTROLS'!G3,I23+1,\"\")","v":"2022-09-07"},null,null,{"$f":"IF($U24>1,VLOOKUP($U24,'MASTER CONTROLS'!$A$3:$D$11,3,FALSE),\"\")","v":""},{"$f":"IF($U24>1,VLOOKUP($U24,'MASTER CONTROLS'!$A$3:$D$11,4,FALSE),\"\")","v":""},null,null,null,null,null,null,null,1,"Wed"]
[null,null,null,null,null,null,null,null,{"$f":"IF(N5<>'MASTER CONTROLS'!G3,I24+1,\"\")","v":"2022-09-08"},null,null,{"$f":"IF($U25>1,VLOOKUP($U25,'MASTER CONTROLS'!$A$3:$D$11,3,FALSE),\"\")","v":""},{"$f":"IF($U25>1,VLOOKUP($U25,'MASTER CONTROLS'!$A$3:$D$11,4,FALSE),\"\")","v":""},null,null,null,null,null,null,null,1,"Thu"]
[null,null,null,null,null,null,null,null,{"$f":"IF(N5<>'MASTER CONTROLS'!G3,I25+1,\"\")","v":"2022-09-09"},null,null,{"$f":"IF($U26>1,VLOOKUP($U26,'MASTER CONTROLS'!$A$3:$D$11,3,FALSE),\"\")","v":""},{"$f":"IF($U26>1,VLOOKUP($U26,'MASTER CONTROLS'!$A$3:$D$11,4,FALSE),\"\")","v":""},null,null,null,null,null,null,null,1,"Fri"]
[null,null,null,null,null,null,null,null,{"$f":"IF(N5<>'MASTER CONTROLS'!G3,I26+1,\"\")","v":"2022-09-10"},null,null,{"$f":"IF($U27>1,VLOOKUP($U27,'MASTER CONTROLS'!$A$3:$D$11,3,FALSE),\"\")","v":""},{"$f":"IF($U27>1,VLOOKUP($U27,'MASTER CONTROLS'!$A$3:$D$11,4,FALSE),\"\")","v":""},null,null,null,null,null,null,null,1,"Sat"]
[null,null,null,null,null,null,null,null,{"$f":"IF(N5<>'MASTER CONTROLS'!G3,I27+1,\"\")","v":"2022-09-11"},null,null,{"$f":"IF($U28>1,VLOOKUP($U28,'MASTER CONTROLS'!$A$3:$D$11,3,FALSE),\"\")","v":""},{"$f":"IF($U28>1,VLOOKUP($U28,'MASTER CONTROLS'!$A$3:$D$11,4,FALSE),\"\")","v":""},null,null,null,null,null,null,null,1,"Sun"]
[null,null,null,null,null,null,null,null,{"$f":"IF(N5<>'MASTER CONTROLS'!G3,I28+1,\"\")","v":"2022-09-12"},null,null,{"$f":"IF($U29>1,VLOOKUP($U29,'MASTER CONTROLS'!$A$3:$D$11,3,FALSE),\"\")","v":""},{"$f":"IF($U29>1,VLOOKUP($U29,'MASTER CONTROLS'!$A$3:$D$11,4,FALSE),\"\")","v":""},null,null,null,null,null,null,null,1,"Mon"]
[null,null,null,null,null,null,null,null,{"$f":"IF(N5<>'MASTER CONTROLS'!G3,I29+1,\"\")","v":"2022-09-13"},null,null,{"$f":"IF($U30>1,VLOOKUP($U30,'MASTER CONTROLS'!$A$3:$D$11,3,FALSE),\"\")","v":""},{"$f":"IF($U30>1,VLOOKUP($U30,'MASTER CONTROLS'!$A$3:$D$11,4,FALSE),\"\")","v":""},null,null,null,null,null,null,null,1,"Tue"]
[null,null,null,null,null,null,null,null,{"$f":"IF(N5<>'MASTER CONTROLS'!G3,I30+1,\"\")","v":"2022-09-14"},null,null,{"$f":"IF($U31>1,VLOOKUP($U31,'MASTER CONTROLS'!$A$3:$D$11,3,FALSE),\"\")","v":""},{"$f":"IF($U31>1,VLOOKUP($U31,'MASTER CONTROLS'!$A$3:$D$11,4,FALSE),\"\")","v":""},null,null,null,null,null,null,null,1,"Wed"]
[null,null,null,null,null,null,null,null,{"$f":"IF(N5<>'MASTER CONTROLS'!G3,I31+1,\"\")","v":"2022-09-15"},null,null,{"$f":"IF($U32>1,VLOOKUP($U32,'MASTER CONTROLS'!$A$3:$D$11,3,FALSE),\"\")","v":""},{"$f":"IF($U32>1,VLOOKUP($U32,'MASTER CONTROLS'!$A$3:$D$11,4,FALSE),\"\")","v":""},null,null,null,null,null,null,null,1,"Thu"]
[null,null,null,null,null,null,null,null,{"$f":"IF(N5<>'MASTER CONTROLS'!G3,I32+1,\"\")","v":"2022-09-16"},null,null,{"$f":"IF($U33>1,VLOOKUP($U33,'MASTER CONTROLS'!$A$3:$D$11,3,FALSE),\"\")","v":""},{"$f":"IF($U33>1,VLOOKUP($U33,'MASTER CONTROLS'!$A$3:$D$11,4,FALSE),\"\")","v":""},null,null,null,null,null,null,null,1,"Fri"]
[null,null,null,null,null,null,null,null,{"$f":"IF(N5<>'MASTER CONTROLS'!G3,I33+1,\"\")","v":"2022-09-17"},null,null,{"$f":"IF($U34>1,VLOOKUP($U34,'MASTER CONTROLS'!$A$3:$D$11,3,FALSE),\"\")","v":""},{"$f":"IF($U34>1,VLOOKUP($U34,'MASTER CONTROLS'!$A$3:$D$11,4,FALSE),\"\")","v":""},null,null,null,null,null,null,null,1,"Sat"]
[null,null,null,null,null,null,null,null,{"$f":"IF(N5<>'MASTER CONTROLS'!G3,I34+1,\"\")","v":"2022-09-18"},null,null,{"$f":"IF($U35>1,VLOOKUP($U35,'MASTER CONTROLS'!$A$3:$D$11,3,FALSE),\"\")","v":""},{"$f":"IF($U35>1,VLOOKUP($U35,'MASTER CONTROLS'!$A$3:$D$11,4,FALSE),\"\")","v":""},null,null,null,null,null,null,null,1,"Sun"]
[null,null,null,null,null,null,null,null,{"$f":"IF(N5<>'MASTER CONTROLS'!G3,I35+1,\"\")","v":"2022-09-19"},null,null,{"$f":"IF($U36>1,VLOOKUP($U36,'MASTER CONTROLS'!$A$3:$D$11,3,FALSE),\"\")","v":""},{"$f":"IF($U36>1,VLOOKUP($U36,'MASTER CONTROLS'!$A$3:$D$11,4,FALSE),\"\")","v":""},null,null,null,null,null,null,null,1,"Mon"]
[null,null,null,null,null,null,null,null,{"$f":"IF(N5<>'MASTER CONTROLS'!G3,I36+1,\"\")","v":"2022-09-20"},null,null,{"$f":"IF($U37>1,VLOOKUP($U37,'MASTER CONTROLS'!$A$3:$D$11,3,FALSE),\"\")","v":""},{"$f":"IF($U37>1,VLOOKUP($U37,'MASTER CONTROLS'!$A$3:$D$11,4,FALSE),\"\")","v":""},null,null,null,null,null,null,null,1,"Tue"]
[null,null,null,null,null,null,null,null,{"$f":"IF(N5<>'MASTER CONTROLS'!G3,I37+1,\"\")","v":"2022-09-21"},null,null,{"$f":"IF($U38>1,VLOOKUP($U38,'MASTER CONTROLS'!$A$3:$D$11,3,FALSE),\"\")","v":""},{"$f":"IF($U38>1,VLOOKUP($U38,'MASTER CONTROLS'!$A$3:$D$11,4,FALSE),\"\")","v":""},null,null,null,null,null,null,null,1,"Wed"]
[null,null,null,null,null,null,null,null,{"$f":"IF(N5<>'MASTER CONTROLS'!G3,I38+1,\"\")","v":"2022-09-22"},null,null,{"$f":"IF($U39>1,VLOOKUP($U39,'MASTER CONTROLS'!$A$3:$D$11,3,FALSE),\"\")","v":""},{"$f":"IF($U39>1,VLOOKUP($U39,'MASTER CONTROLS'!$A$3:$D$11,4,FALSE),\"\")","v":""},null,null,null,null,null,null,null,1,"Thu"]
[null,null,null,null,null,null,null,null,{"$f":"IF(N5<>'MASTER CONTROLS'!G3,I39+1,\"\")","v":"2022-09-23"},null,null,{"$f":"IF($U40>1,VLOOKUP($U40,'MASTER CONTROLS'!$A$3:$D$11,3,FALSE),\"\")","v":""},{"$f":"IF($U40>1,VLOOKUP($U40,'MASTER CONTROLS'!$A$3:$D$11,4,FALSE),\"\")","v":""},null,null,null,null,null,null,null,1,"Fri"]
[null,null,null,null,null,null,null,null,{"$f":"IF(N5<>'MASTER CONTROLS'!G3,I40+1,\"\")","v":"2022-09-24"},null,null,{"$f":"IF($U41>1,VLOOKUP($U41,'MASTER CONTROLS'!$A$3:$D$11,3,FALSE),\"\")","v":""},{"$f":"IF($U41>1,VLOOKUP($U41,'MASTER CONTROLS'!$A$3:$D$11,4,FALSE),\"\")","v":""},null,null,null,null,null,null,null,1,"Sat"]
[null,null,null,null,null,null,null,null,{"$f":"IF(N5<>'MASTER CONTROLS'!G3,I41+1,\"\")","v":"2022-09-25"},null,null,{"$f":"IF($U42>1,VLOOKUP($U42,'MASTER CONTROLS'!$A$3:$D$11,3,FALSE),\"\")","v":""},{"$f":"IF($U42>1,VLOOKUP($U42,'MASTER CONTROLS'!$A$3:$D$11,4,FALSE),\"\")","v":""},null,null,null,null,null,null,null,1,"Sun"]
[null,null,null,null,null,null,null,null,{"$f":"IF(N5<>'MASTER CONTROLS'!G3,I42+1,\"\")","v":"2022-09-26"},null,null,{"$f":"IF($U43>1,VLOOKUP($U43,'MASTER CONTROLS'!$A$3:$D$11,3,FALSE),\"\")","v":""},{"$f":"IF($U43>1,VLOOKUP($U43,'MASTER CONTROLS'!$A$3:$D$11,4,FALSE),\"\")","v":""},null,null,null,null,null,null,null,1,"Mon"]
[null,null,null,null,null,null,null,null,{"$f":"IF(N5<>'MASTER CONTROLS'!G3,I43+1,\"\")","v":"2022-09-27"},null,null,{"$f":"IF($U44>1,VLOOKUP($U44,'MASTER CONTROLS'!$A$3:$D$11,3,FALSE),\"\")","v":""},{"$f":"IF($U44>1,VLOOKUP($U44,'MASTER CONTROLS'!$A$3:$D$11,4,FALSE),\"\")","v":""},null,null,null,null,null,null,null,1,"Tue"]
[null,null,null,null,null,null,null,null,{"$f":"IF(N5<>'MASTER CONTROLS'!G3,I44+1,\"\")","v":"2022-09-28"},null,null,{"$f":"IF($U45>1,VLOOKUP($U45,'MASTER CONTROLS'!$A$3:$D$11,3,FALSE),\"\")","v":""},{"$f":"IF($U45>1,VLOOKUP($U45,'MASTER CONTROLS'!$A$3:$D$11,4,FALSE),\"\")","v":""},null,null,null,null,null,null,null,1,"Wed"]
[null,null,null,null,null,null,null,null,{"$f":"IF(AND(N$5<>'MASTER CONTROLS'!$G$3,I45<VLOOKUP(N$5,'MASTER CONTROLS'!$G$3:$I$15,3)),I45+1,\"\")","v":"2022-09-29"},null,null,{"$f":"IF($U46>1,VLOOKUP($U46,'MASTER CONTROLS'!$A$3:$D$11,3,FALSE),\"\")","v":""},{"$f":"IF($U46>1,VLOOKUP($U46,'MASTER CONTROLS'!$A$3:$D$11,4,FALSE),\"\")","v":""},null,null,null,null,null,null,null,1,"Thu"]
[null,null,null,null,null,null,null,null,{"$f":"IF(AND(N$5<>'MASTER CONTROLS'!$G$3,I46<VLOOKUP(N$5,'MASTER CONTROLS'!$G$3:$I$15,3)),I46+1,\"\")","v":"2022-09-30"},null,null,{"$f":"IF($U47>1,VLOOKUP($U47,'MASTER CONTROLS'!$A$3:$D$11,3,FALSE),\"\")","v":""},{"$f":"IF($U47>1,VLOOKUP($U47,'MASTER CONTROLS'!$A$3:$D$11,4,FALSE),\"\")","v":""},null,null,null,null,null,null,null,1,"Fri"]
[null,null,null,null,null,null,null,null,{"$f":"IF(AND(N$5<>'MASTER CONTROLS'!$G$3,I47<VLOOKUP(N$5,'MASTER CONTROLS'!$G$3:$I$15,3)),I47+1,\"\")","v":""},null,null,{"$f":"IF($U48>1,VLOOKUP($U48,'MASTER CONTROLS'!$A$3:$D$11,3,FALSE),\"\")","v":""},{"$f":"IF($U48>1,VLOOKUP($U48,'MASTER CONTROLS'!$A$3:$D$11,4,FALSE),\"\")","v":""},null,null,null,null,null,null,null,1,""]
["TOTALS",null,null,null,null,null,{"$f":"SUM(G18:H48)","v":0},null,null,null,{"$f":"SUM(K18:K48)","v":0},0,0,0,0,0]
[]
["Office Staff Section",null,null,null,null,null,null,null,null,null,null,null,null,"Phone","Internet","Total"]
[null,null,null,null,null,null,null,null,null,null,null,null,null,null,null,{"$f":"SUM(N52:O52)","v":0}]
[]
["Pastor's Section",null,null,null,null,null,null,null,{"$f":"Jan!I54","v":"Profession of Faith"},null,null,"Worship Service Attendance"]
[{"$f":"Jan!A55","v":"Church Name "},null,null,null,null,null,null,"Baptisms",null,null,"Transfers","Week 1","Week 2","Week 3","Week 4","Week 5"]
[null,null,null,null,null,null,null,null,null,null,null,null,null,null,null,null,{"$f":"COUNTIF(V18:V48,\"Sat\")","v":4},{"$f":"COUNT(G56:P56)","v":0}]
[]
[]
[]
[]
["Comments & Notes"]
[]
[null,null,null,null,null,null,null,null,null,null,null,null,null,null,null,null,null,null,null,null,false]
[]
["OFFICE USE ONLY"]
["10200) Travel Budget",null,null,null,null,null,"10201) Per Diem Tx",null,null,null,null,null,"11206) Travel Misc"]
["11211) Non-Tax Miles",null,null,null,null,null,"11201) Per Diem NTx",null,null,null,null,null,"11230) Conv./Mtgs"]
["11200) Special Miles",null,null,null,null,null,"11202) Lodging",null,null,null,null,null,"11403) Phone"]
["10212) Spouse Travel",null,null,null,null,null,"11203) Car Rental",null,null,null,null,null,"10408) Internet"]
["11405) Entertainment",null,null,null,null,null,"11209) Airfare Travel"]

{"sheet":"Oct","index":10,"n_rows":70,"n_cols":22,"rows_kept":70,"cut":false,"hidden":false,"merged":[[19,6,19,7],[18,6,18,7],[17,6,17,7],[10,6,10,7],[29,6,29,7],[28,6,28,7],[27,6,27,7],[26,6,26,7],[25,6,25,7],[24,6,24,7],[23,6,23,7],[22,6,22,7],[21,6,21,7],[44,6,44,7],[43,6,43,7],[42,6,42,7],[41,6,41,7],[40,6,40,7],[67,0,67,2],[69,0,69,1],[69,6,69,7],[20,6,20,7],[38,6,38,7],[37,6,37,7],[36,6,36,7],[35,6,35,7],[34,6,34,7],[33,6,33,7],[32,6,32,7],[39,8,39,9],[46,8,46,9],[26,8,26,9],[31,1,31,5],[32,1,32,5],[34,8,34,9],[33,8,33,9],[30,8,30,9],[38,8,38,9],[42,8,42,9],[44,1,44,5],[43,1,43,5],[34,1,34,5],[36,1,36,5],[35,1,35,5],[39,1,39,5],[40,1,40,5],[36,8,36,9],[37,8,37,9],[41,8,41,9],[29,8,29,9],[31,6,31,7],[30,6,30,7],[46,6,46,7],[69,12,69,13],[68,14,68,15],[65,14,65,15],[66,14,66,15],[67,14,67,15],[65,12,65,13],[0,0,0,15],[37,1,37,5],[38,1,38,5],[9,1,9,5],[10,1,10,5],[17,1,17,5],[9,14,10,15],[9,6,9,7],[35,8,35,9],[1,0,1,15],[8,10,8,12],[3,1,3,9],[7,5,7,10],[4,1,4,9],[5,1,5,9],[19,1,19,5],[19,8,19,9],[8,0,8,9],[68,12,68,13],[66,0,66,2],[67,6,67,8],[68,6,68,8],[47,1,47,5],[59,0,59,2],[68,3,68,4],[68,0,68,2],[55,0,55,6],[56,0,56,6],[59,6,59,8],[57,0,57,6],[64,0,64,15],[66,6,66,8],[59,9,59,10],[50,0,50,2],[54,0,54,5],[60,2,61,15],[59,11,59,12],[47,8,47,9],[56,8,56,9],[55,8,55,9],[48,6,48,7],[47,6,47,7],[18,8,18,9],[3,16,3,19],[4,16,6,19],[7,16,7,19],[6,0,6,9],[7,1,7,3],[9,11,9,12],[4,13,4,15],[5,13,5,15],[6,13,8,15],[18,1,18,5],[9,8,10,9],[17,8,17,9],[21,8,21,9],[40,8,40,9],[31,8,31,9],[32,8,32,9],[20,8,20,9],[24,8,24,9],[25,1,25,5],[22,1,22,5],[27,8,27,9],[23,8,23,9],[21,1,21,5],[25,8,25,9],[22,8,22,9],[20,1,20,5],[24,1,24,5],[27,1,27,5],[23,1,23,5],[29,1,29,5],[30,1,30,5],[28,1,28,5],[28,8,28,9],[33,1,33,5],[26,1,26,5],[39,6,39,7],[45,1,45,5],[48,0,48,5],[67,12,67,13],[66,12,66,13],[41,1,41,5],[46,1,46,5],[65,3,65,4],[65,0,65,2],[65,6,65,8],[66,3,66,4],[53,0,53,1],[48,8,48,9],[53,8,54,9],[51,0,51,12],[53,11,53,15],[67,3,67,4],[42,1,42,5],[60,0,61,1],[59,13,59,14],[57,8,57,9],[44,8,44,9],[43,8,43,9],[45,8,45,9],[45,6,45,7]]}
[{"$f":"\"Northern California Conference Expense Report\" & IF($U$63=TRUE,\" (REVISED)\",\"\")","v":"Northern California Conference Expense Report"}]
[{"$f":"Jan!A2","v":"Email to: payroll@nccsda.com      "},null,null,null,null,null,null,null,null,null,null,null,null,null,null,null,null,null,null,null,false]
[]
["Name",{"$f":"IF(Sep!B4<>\"\",Sep!B4,\"\")","v":""},null,null,{"$f":"IF(Jan!E4<>\"\",Jan!E4,\"\")","v":""},null,null,{"$f":"IF(Jan!H4<>\"\",Jan!H4,\"\")","v":""},null,null,null,null,null,null,null,null,"Per Diem Note:"]
["Address",{"$f":"IF(Sep!B5<>\"\",Sep!B5,\"\")","v":""},null,null,{"$f":"IF(Jan!E5<>\"\",Jan!E5,\"\")","v":""},null,null,{"$f":"IF(Jan!H5<>\"\",Jan!H5,\"\")","v":""},null,null,null,null,null,{"$f":"'MASTER CONTROLS'!G13","v":"2022-10-01"},null,null,"1) If you are away from home and have an overnight stay on either side of a day you qualify for per diem, choose an option with NT."]
[null,{"$f":"IF(Sep!B6<>\"\",Sep!B6,\"\")","v":""},null,null,{"$f":"IF(Jan!E6<>\"\",Jan!E6,\"\")","v":""},null,null,{"$f":"IF(Jan!H6<>\"\",Jan!H6,\"\")","v":""},null,null,null,null,null,{"$f":" IF(N5<>'MASTER CONTROLS'!G3,\"Due \" & TEXT(DATE(1,MONTH(I18)+1,1),\"mmmm\") & \" 3rd.\",\"\")","v":"Due November 3rd."}]
["Best way to contact:",null,null,null,null,null,null,null,null,null,null,null,null,"*Reimbursements are made for completed reports including original receipts with travel approval from ADCO or assigned job duties. Lodging must be documented with a folio."]
["Phone:",{"$f":"IF(Sep!B8<>\"\",Sep!B8,\"\")","v":""},null,null,"Email:",{"$f":"IF(Sep!F8<>\"\",Sep!F8,\"\")","v":""},null,null,{"$f":"IF(Jan!I8<>\"\",Jan!I8,\"\")","v":""},null,null,null,null,null,null,null,{"$f":"Jan!Q8","v":"2) Per diem for events that do not include an overnight stay are taxable. Spousal per diems are always taxable."}]
[{"$f":"Jan!A9","v":"Please log in to APS Employee online to update your address and phone number."},null,null,null,null,null,null,null,null,null,"** ADCO must approve Special Mileage."]
["Short","Daily Activity Description",null,null,null,null,null,null,"Date",null,"Special","Per Diem",null,null,"Air/Car/Gas/Transit    Other",null,null,"PD Tx","PD NTx","Per Diem","Ans: Per"]
["Description","Example: Visitation, Sermon Prep, etc.",null,null,null,null,"Budgeted Mileage",null,null,null,"Mileage**","Taxable","Non-Tax","Lodging*",null,null,null,{"$f":"$L$49","v":0},{"$f":"$M$49","v":0},"Totals","Diem"]
[]
["Worked"]
["Day Off"]
["Vacation"]
["Sick Day"]
["Holiday"]
[null,null,null,null,null,null,null,null,{"$f":"IF(N5<>'MASTER CONTROLS'!G3,N5,\"\")","v":"2022-10-01"},null,null,{"$f":"IF($U18>1,VLOOKUP($U18,'MASTER CONTROLS'!$A$3:$D$11,3,FALSE),\"\")","v":""},{"$f":"IF($U18>1,VLOOKUP($U18,'MASTER CONTROLS'!$A$3:$D$11,4,FALSE),\"\")","v":""},null,null,null,null,null,null,null,1,{"$f":"TEXT(I18,\"ddd\")","v":"Sat"}]
[null,null,null,null,null,null,null,null,{"$f":"IF(N5<>'MASTER CONTROLS'!G3,I18+1,\"\")","v":"2022-10-02"},null,null,{"$f":"IF($U19>1,VLOOKUP($U19,'MASTER CONTROLS'!$A$3:$D$11,3,FALSE),\"\")","v":""},{"$f":"IF($U19>1,VLOOKUP($U19,'MASTER CONTROLS'!$A$3:$D$11,4,FALSE),\"\")","v":""},null,null,null,null,null,null,null,1,"Sun"]
[null,null,null,null,null,null,null,null,{"$f":"IF(N5<>'MASTER CONTROLS'!G3,I19+1,\"\")","v":"2022-10-03"},null,null,{"$f":"IF($U20>1,VLOOKUP($U20,'MASTER CONTROLS'!$A$3:$D$11,3,FALSE),\"\")","v":""},{"$f":"IF($U20>1,VLOOKUP($U20,'MASTER CONTROLS'!$A$3:$D$11,4,FALSE),\"\")","v":""},null,null,null,null,null,null,null,1,"Mon"]
[null,null,null,null,null,null,null,null,{"$f":"IF(N5<>'MASTER CONTROLS'!G3,I20+1,\"\")","v":"2022-10-04"},null,null,{"$f":"IF($U21>1,VLOOKUP($U21,'MASTER CONTROLS'!$A$3:$D$11,3,FALSE),\"\")","v":""},{"$f":"IF($U21>1,VLOOKUP($U21,'MASTER CONTROLS'!$A$3:$D$11,4,FALSE),\"\")","v":""},null,null,null,null,null,null,null,1,"Tue"]
[null,null,null,null,null,null,null,null,{"$f":"IF(N5<>'MASTER CONTROLS'!G3,I21+1,\"\")","v":"2022-10-05"},null,null,{"$f":"IF($U22>1,VLOOKUP($U22,'MASTER CONTROLS'!$A$3:$D$11,3,FALSE),\"\")","v":""},{"$f":"IF($U22>1,VLOOKUP($U22,'MASTER CONTROLS'!$A$3:$D$11,4,FALSE),\"\")","v":""},null,null,null,null,null,null,null,1,"Wed"]
[null,null,null,null,null,null,null,null,{"$f":"IF(N5<>'MASTER CONTROLS'!G3,I22+1,\"\")","v":"2022-10-06"},null,null,{"$f":"IF($U23>1,VLOOKUP($U23,'MASTER CONTROLS'!$A$3:$D$11,3,FALSE),\"\")","v":""},{"$f":"IF($U23>1,VLOOKUP($U23,'MASTER CONTROLS'!$A$3:$D$11,4,FALSE),\"\")","v":""},null,null,null,null,null,null,null,1,"Thu"]
[null,null,null,null,null,null,null,null,{"$f":"IF(N5<>'MASTER CONTROLS'!G3,I23+1,\"\")","v":"2022-10-07"},null,null,{"$f":"IF($U24>1,VLOOKUP($U24,'MASTER CONTROLS'!$A$3:$D$11,3,FALSE),\"\")","v":""},{"$f":"IF($U24>1,VLOOKUP($U24,'MASTER CONTROLS'!$A$3:$D$11,4,FALSE),\"\")","v":""},null,null,null,null,null,null,null,1,"Fri"]
[null,null,null,null,null,null,null,null,{"$f":"IF(N5<>'MASTER CONTROLS'!G3,I24+1,\"\")","v":"2022-10-08"},null,null,{"$f":"IF($U25>1,VLOOKUP($U25,'MASTER CONTROLS'!$A$3:$D$11,3,FALSE),\"\")","v":""},{"$f":"IF($U25>1,VLOOKUP($U25,'MASTER CONTROLS'!$A$3:$D$11,4,FALSE),\"\")","v":""},null,null,null,null,null,null,null,1,"Sat"]
[null,null,null,null,null,null,null,null,{"$f":"IF(N5<>'MASTER CONTROLS'!G3,I25+1,\"\")","v":"2022-10-09"},null,null,{"$f":"IF($U26>1,VLOOKUP($U26,'MASTER CONTROLS'!$A$3:$D$11,3,FALSE),\"\")","v":""},{"$f":"IF($U26>1,VLOOKUP($U26,'MASTER CONTROLS'!$A$3:$D$11,4,FALSE),\"\")","v":""},null,null,null,null,null,null,null,1,"Sun"]
[null,null,null,null,null,null,null,null,{"$f":"IF(N5<>'MASTER CONTROLS'!G3,I26+1,\"\")","v":"2022-10-10"},null,null,{"$f":"IF($U27>1,VLOOKUP($U27,'MASTER CONTROLS'!$A$3:$D$11,3,FALSE),\"\")","v":""},{"$f":"IF($U27>1,VLOOKUP($U27,'MASTER CONTROLS'!$A$3:$D$11,4,FALSE),\"\")","v":""},null,null,null,null,null,null,null,1,"Mon"]
[null,null,null,null,null,null,null,null,{"$f":"IF(N5<>'MASTER CONTROLS'!G3,I27+1,\"\")","v":"2022-10-11"},null,null,{"$f":"IF($U28>1,VLOOKUP($U28,'MASTER CONTROLS'!$A$3:$D$11,3,FALSE),\"\")","v":""},{"$f":"IF($U28>1,VLOOKUP($U28,'MASTER CONTROLS'!$A$3:$D$11,4,FALSE),\"\")","v":""},null,null,null,null,null,null,null,1,"Tue"]
[null,null,null,null,null,null,null,null,{"$f":"IF(N5<>'MASTER CONTROLS'!G3,I28+1,\"\")","v":"2022-10-12"},null,null,{"$f":"IF($U29>1,VLOOKUP($U29,'MASTER CONTROLS'!$A$3:$D$11,3,FALSE),\"\")","v":""},{"$f":"IF($U29>1,VLOOKUP($U29,'MASTER CONTROLS'!$A$3:$D$11,4,FALSE),\"\")","v":""},null,null,null,null,null,null,null,1,"Wed"]
[null,null,null,null,null,null,null,null,{"$f":"IF(N5<>'MASTER CONTROLS'!G3,I29+1,\"\")","v":"2022-10-13"},null,null,{"$f":"IF($U30>1,VLOOKUP($U30,'MASTER CONTROLS'!$A$3:$D$11,3,FALSE),\"\")","v":""},{"$f":"IF($U30>1,VLOOKUP($U30,'MASTER CONTROLS'!$A$3:$D$11,4,FALSE),\"\")","v":""},null,null,null,null,null,null,null,1,"Thu"]
[null,null,null,null,null,null,null,null,{"$f":"IF(N5<>'MASTER CONTROLS'!G3,I30+1,\"\")","v":"2022-10-14"},null,null,{"$f":"IF($U31>1,VLOOKUP($U31,'MASTER CONTROLS'!$A$3:$D$11,3,FALSE),\"\")","v":""},{"$f":"IF($U31>1,VLOOKUP($U31,'MASTER CONTROLS'!$A$3:$D$11,4,FALSE),\"\")","v":""},null,null,null,null,null,null,null,1,"Fri"]
[null,null,null,null,null,null,null,null,{"$f":"IF(N5<>'MASTER CONTROLS'!G3,I31+1,\"\")","v":"2022-10-15"},null,null,{"$f":"IF($U32>1,VLOOKUP($U32,'MASTER CONTROLS'!$A$3:$D$11,3,FALSE),\"\")","v":""},{"$f":"IF($U32>1,VLOOKUP($U32,'MASTER CONTROLS'!$A$3:$D$11,4,FALSE),\"\")","v":""},null,null,null,null,null,null,null,1,"Sat"]
[null,null,null,null,null,null,null,null,{"$f":"IF(N5<>'MASTER CONTROLS'!G3,I32+1,\"\")","v":"2022-10-16"},null,null,{"$f":"IF($U33>1,VLOOKUP($U33,'MASTER CONTROLS'!$A$3:$D$11,3,FALSE),\"\")","v":""},{"$f":"IF($U33>1,VLOOKUP($U33,'MASTER CONTROLS'!$A$3:$D$11,4,FALSE),\"\")","v":""},null,null,null,null,null,null,null,1,"Sun"]
[null,null,null,null,null,null,null,null,{"$f":"IF(N5<>'MASTER CONTROLS'!G3,I33+1,\"\")","v":"2022-10-17"},null,null,{"$f":"IF($U34>1,VLOOKUP($U34,'MASTER CONTROLS'!$A$3:$D$11,3,FALSE),\"\")","v":""},{"$f":"IF($U34>1,VLOOKUP($U34,'MASTER CONTROLS'!$A$3:$D$11,4,FALSE),\"\")","v":""},null,null,null,null,null,null,null,1,"Mon"]
[null,null,null,null,null,null,null,null,{"$f":"IF(N5<>'MASTER CONTROLS'!G3,I34+1,\"\")","v":"2022-10-18"},null,null,{"$f":"IF($U35>1,VLOOKUP($U35,'MASTER CONTROLS'!$A$3:$D$11,3,FALSE),\"\")","v":""},{"$f":"IF($U35>1,VLOOKUP($U35,'MASTER CONTROLS'!$A$3:$D$11,4,FALSE),\"\")","v":""},null,null,null,null,null,null,null,1,"Tue"]
[null,null,null,null,null,null,null,null,{"$f":"IF(N5<>'MASTER CONTROLS'!G3,I35+1,\"\")","v":"2022-10-19"},null,null,{"$f":"IF($U36>1,VLOOKUP($U36,'MASTER CONTROLS'!$A$3:$D$11,3,FALSE),\"\")","v":""},{"$f":"IF($U36>1,VLOOKUP($U36,'MASTER CONTROLS'!$A$3:$D$11,4,FALSE),\"\")","v":""},null,null,null,null,null,null,null,1,"Wed"]
[null,null,null,null,null,null,null,null,{"$f":"IF(N5<>'MASTER CONTROLS'!G3,I36+1,\"\")","v":"2022-10-20"},null,null,{"$f":"IF($U37>1,VLOOKUP($U37,'MASTER CONTROLS'!$A$3:$D$11,3,FALSE),\"\")","v":""},{"$f":"IF($U37>1,VLOOKUP($U37,'MASTER CONTROLS'!$A$3:$D$11,4,FALSE),\"\")","v":""},null,null,null,null,null,null,null,1,"Thu"]
[null,null,null,null,null,null,null,null,{"$f":"IF(N5<>'MASTER CONTROLS'!G3,I37+1,\"\")","v":"2022-10-21"},null,null,{"$f":"IF($U38>1,VLOOKUP($U38,'MASTER CONTROLS'!$A$3:$D$11,3,FALSE),\"\")","v":""},{"$f":"IF($U38>1,VLOOKUP($U38,'MASTER CONTROLS'!$A$3:$D$11,4,FALSE),\"\")","v":""},null,null,null,null,null,null,null,1,"Fri"]
[null,null,null,null,null,null,null,null,{"$f":"IF(N5<>'MASTER CONTROLS'!G3,I38+1,\"\")","v":"2022-10-22"},null,null,{"$f":"IF($U39>1,VLOOKUP($U39,'MASTER CONTROLS'!$A$3:$D$11,3,FALSE),\"\")","v":""},{"$f":"IF($U39>1,VLOOKUP($U39,'MASTER CONTROLS'!$A$3:$D$11,4,FALSE),\"\")","v":""},null,null,null,null,null,null,null,1,"Sat"]
[null,null,null,null,null,null,null,null,{"$f":"IF(N5<>'MASTER CONTROLS'!G3,I39+1,\"\")","v":"2022-10-23"},null,null,{"$f":"IF($U40>1,VLOOKUP($U40,'MASTER CONTROLS'!$A$3:$D$11,3,FALSE),\"\")","v":""},{"$f":"IF($U40>1,VLOOKUP($U40,'MASTER CONTROLS'!$A$3:$D$11,4,FALSE),\"\")","v":""},null,null,null,null,null,null,null,1,"Sun"]
[null,null,null,null,null,null,null,null,{"$f":"IF(N5<>'MASTER CONTROLS'!G3,I40+1,\"\")","v":"2022-10-24"},null,null,{"$f":"IF($U41>1,VLOOKUP($U41,'MASTER CONTROLS'!$A$3:$D$11,3,FALSE),\"\")","v":""},{"$f":"IF($U41>1,VLOOKUP($U41,'MASTER CONTROLS'!$A$3:$D$11,4,FALSE),\"\")","v":""},null,null,null,null,null,null,null,1,"Mon"]
[null,null,null,null,null,null,null,null,{"$f":"IF(N5<>'MASTER CONTROLS'!G3,I41+1,\"\")","v":"2022-10-25"},null,null,{"$f":"IF($U42>1,VLOOKUP($U42,'MASTER CONTROLS'!$A$3:$D$11,3,FALSE),\"\")","v":""},{"$f":"IF($U42>1,VLOOKUP($U42,'MASTER CONTROLS'!$A$3:$D$11,4,FALSE),\"\")","v":""},null,null,null,null,null,null,null,1,"Tue"]
[null,null,null,null,null,null,null,null,{"$f":"IF(N5<>'MASTER CONTROLS'!G3,I42+1,\"\")","v":"2022-10-26"},null,null,{"$f":"IF($U43>1,VLOOKUP($U43,'MASTER CONTROLS'!$A$3:$D$11,3,FALSE),\"\")","v":""},{"$f":"IF($U43>1,VLOOKUP($U43,'MASTER CONTROLS'!$A$3:$D$11,4,FALSE),\"\")","v":""},null,null,null,null,null,null,null,1,"Wed"]
[null,null,null,null,null,null,null,null,{"$f":"IF(N5<>'MASTER CONTROLS'!G3,I43+1,\"\")","v":"2022-10-27"},null,null,{"$f":"IF($U44>1,VLOOKUP($U44,'MASTER CONTROLS'!$A$3:$D$11,3,FALSE),\"\")","v":""},{"$f":"IF($U44>1,VLOOKUP($U44,'MASTER CONTROLS'!$A$3:$D$11,4,FALSE),\"\")","v":""},null,null,null,null,null,null,null,1,"Thu"]
[null,null,null,null,null,null,null,null,{"$f":"IF(N5<>'MASTER CONTROLS'!G3,I44+1,\"\")","v":"2022-10-28"},null,null,{"$f":"IF($U45>1,VLOOKUP($U45,'MASTER CONTROLS'!$A$3:$D$11,3,FALSE),\"\")","v":""},{"$f":"IF($U45>1,VLOOKUP($U45,'MASTER CONTROLS'!$A$3:$D$11,4,FALSE),\"\")","v":""},null,null,null,null,null,null,null,1,"Fri"]
[null,null,null,null,null,null,null,null,{"$f":"IF(AND(N$5<>'MASTER CONTROLS'!$G$3,I45<VLOOKUP(N$5,'MASTER CONTROLS'!$G$3:$I$15,3)),I45+1,\"\")","v":"2022-10-29"},null,null,{"$f":"IF($U46>1,VLOOKUP($U46,'MASTER CONTROLS'!$A$3:$D$11,3,FALSE),\"\")","v":""},{"$f":"IF($U46>1,VLOOKUP($U46,'MASTER CONTROLS'!$A$3:$D$11,4,FALSE),\"\")","v":""},null,null,null,null,null,null,null,1,"Sat"]
[null,null,null,null,null,null,null,null,{"$f":"IF(AND(N$5<>'MASTER CONTROLS'!$G$3,I46<VLOOKUP(N$5,'MASTER CONTROLS'!$G$3:$I$15,3)),I46+1,\"\")","v":"2022-10-30"},null,null,{"$f":"IF($U47>1,VLOOKUP($U47,'MASTER CONTROLS'!$A$3:$D$11,3,FALSE),\"\")","v":""},{"$f":"IF($U47>1,VLOOKUP($U47,'MASTER CONTROLS'!$A$3:$D$11,4,FALSE),\"\")","v":""},null,null,null,null,null,null,null,1,"Sun"]
[null,null,null,null,null,null,null,null,{"$f":"IF(AND(N$5<>'MASTER CONTROLS'!$G$3,I47<VLOOKUP(N$5,'MASTER CONTROLS'!$G$3:$I$15,3)),I47+1,\"\")","v":"2022-10-31"},null,null,{"$f":"IF($U48>1,VLOOKUP($U48,'MASTER CONTROLS'!$A$3:$D$11,3,FALSE),\"\")","v":""},{"$f":"IF($U48>1,VLOOKUP($U48,'MASTER CONTROLS'!$A$3:$D$11,4,FALSE),\"\")","v":""},null,null,null,null,null,null,null,1,"Mon"]
["TOTALS",null,null,null,null,null,{"$f":"SUM(G18:H48)","v":0},null,null,null,{"$f":"SUM(K18:K48)","v":0},0,0,0,0,0]
[]
["Office Staff Section",null,null,null,null,null,null,null,null,null,null,null,null,"Phone","Internet","Total"]
[null,null,null,null,null,null,null,null,null,null,null,null,null,null,null,{"$f":"SUM(N52:O52)","v":0}]
[]
["Pastor's Section",null,null,null,null,null,null,null,{"$f":"Jan!I54","v":"Profession of Faith"},null,null,"Worship Service Attendance"]
[{"$f":"Jan!A55","v":"Church Name "},null,null,null,null,null,null,"Baptisms",null,null,"Transfers","Week 1","Week 2","Week 3","Week 4","Week 5"]
[null,null,null,null,null,null,null,null,null,null,null,null,null,null,null,null,{"$f":"COUNTIF(V18:V48,\"Sat\")","v":5},{"$f":"COUNT(G56:P56)","v":0}]
[]
[]
[]
[]
["Comments & Notes"]
[]
[null,null,null,null,null,null,null,null,null,null,null,null,null,null,null,null,null,null,null,null,false]
[]
["OFFICE USE ONLY"]
["10200) Travel Budget",null,null,null,null,null,"10201) Per Diem Tx",null,null,null,null,null,"11206) Travel Misc"]
["11211) Non-Tax Miles",null,null,null,null,null,"11201) Per Diem NTx",null,null,null,null,null,"11230) Conv./Mtgs"]
["11200) Special Miles",null,null,null,null,null,"11202) Lodging",null,null,null,null,null,"11403) Phone"]
["10212) Spouse Travel",null,null,null,null,null,"11203) Car Rental",null,null,null,null,null,"10408) Internet"]
["11405) Entertainment",null,null,null,null,null,"11209) Airfare Travel"]

{"sheet":"Nov","index":11,"n_rows":70,"n_cols":22,"rows_kept":70,"cut":false,"hidden":false,"merged":[[67,0,67,2],[69,0,69,1],[69,6,69,7],[21,6,21,7],[20,6,20,7],[19,6,19,7],[18,6,18,7],[17,6,17,7],[10,6,10,7],[48,6,48,7],[47,6,47,7],[46,6,46,7],[45,6,45,7],[44,6,44,7],[43,6,43,7],[30,6,30,7],[29,6,29,7],[28,6,28,7],[27,6,27,7],[26,6,26,7],[25,6,25,7],[24,6,24,7],[23,6,23,7],[22,6,22,7],[3,16,3,19],[4,16,6,19],[7,16,7,19],[6,0,6,9],[7,1,7,3],[9,11,9,12],[9,8,10,9],[40,8,40,9],[4,13,4,15],[5,13,5,15],[6,13,8,15],[8,0,8,9],[8,10,8,12],[3,1,3,9],[7,5,7,10],[4,1,4,9],[5,1,5,9],[20,1,20,5],[21,1,21,5],[25,8,25,9],[17,1,17,5],[23,1,23,5],[29,1,29,5],[19,1,19,5],[55,0,55,6],[17,8,17,9],[18,1,18,5],[19,8,19,9],[42,8,42,9],[29,8,29,9],[21,8,21,9],[31,8,31,9],[32,8,32,9],[20,8,20,9],[22,1,22,5],[24,1,24,5],[26,1,26,5],[26,8,26,9],[28,8,28,9],[18,8,18,9],[28,1,28,5],[32,1,32,5],[9,6,9,7],[35,8,35,9],[1,0,1,15],[69,12,69,13],[67,6,67,8],[68,6,68,8],[45,1,45,5],[51,0,51,12],[46,8,46,9],[66,6,66,8],[64,0,64,15],[66,3,66,4],[67,3,67,4],[66,0,66,2],[65,0,65,2],[47,8,47,9],[56,8,56,9],[53,0,53,1],[50,0,50,2],[48,0,48,5],[60,0,61,1],[54,0,54,5],[59,13,59,14],[65,12,65,13],[0,0,0,15],[37,1,37,5],[38,1,38,5],[9,1,9,5],[10,1,10,5],[39,8,39,9],[24,8,24,9],[25,1,25,5],[27,1,27,5],[36,8,36,9],[34,1,34,5],[36,1,36,5],[35,1,35,5],[39,1,39,5],[22,8,22,9],[38,8,38,9],[30,1,30,5],[33,8,33,9],[30,8,30,9],[34,8,34,9],[27,8,27,9],[23,8,23,9],[31,1,31,5],[9,14,10,15],[65,14,65,15],[66,12,66,13],[41,1,41,5],[41,8,41,9],[43,1,43,5],[42,1,42,5],[37,8,37,9],[33,1,33,5],[42,6,42,7],[41,6,41,7],[40,6,40,7],[39,6,39,7],[38,6,38,7],[37,6,37,7],[36,6,36,7],[35,6,35,7],[34,6,34,7],[33,6,33,7],[53,11,53,15],[44,8,44,9],[43,8,43,9],[40,1,40,5],[59,9,59,10],[55,8,55,9],[65,3,65,4],[56,0,56,6],[32,6,32,7],[31,6,31,7],[68,0,68,2],[68,12,68,13],[67,12,67,13],[57,0,57,6],[65,6,65,8],[48,8,48,9],[53,8,54,9],[44,1,44,5],[57,8,57,9],[45,8,45,9],[59,0,59,2],[68,3,68,4],[60,2,61,15],[46,1,46,5],[47,1,47,5],[68,14,68,15],[59,11,59,12],[66,14,66,15],[67,14,67,15],[59,6,59,8]]}
[{"$f":"\"Northern California Conference Expense Report\" & IF($U$63=TRUE,\" (REVISED)\",\"\")","v":"Northern California Conference Expense Report"}]
[{"$f":"Jan!A2","v":"Email to: payroll@nccsda.com      "},null,null,null,null,null,null,null,null,null,null,null,null,null,null,null,null,null,null,null,false]
[]
["Name",{"$f":"IF(Jan!B4<>\"\",Jan!B4,\"\")","v":""},null,null,null,null,null,null,null,null,null,null,null,null,null,null,"Per Diem Note:"]
["Address",{"$f":"IF(Oct!B5<>\"\",Oct!B5,\"\")","v":""},null,null,{"$f":"IF(Jan!E5<>\"\",Jan!E5,\"\")","v":""},null,null,{"$f":"IF(Jan!H5<>\"\",Jan!H5,\"\")","v":""},null,null,null,null,null,{"$f":"'MASTER CONTROLS'!G14","v":"2022-11-01"},null,null,"1) If you are away from home and have an overnight stay on either side of a day you qualify for per diem, choose an option with NT."]
[null,{"$f":"IF(Oct!B6<>\"\",Oct!B6,\"\")","v":""},null,null,{"$f":"IF(Jan!E6<>\"\",Jan!E6,\"\")","v":""},null,null,{"$f":"IF(Jan!H6<>\"\",Jan!H6,\"\")","v":""},null,null,null,null,null,{"$f":" IF(N5<>'MASTER CONTROLS'!G3,\"Due \" & TEXT(DATE(1,MONTH(I18)+1,1),\"mmmm\") & \" 3rd.\",\"\")","v":"Due December 3rd."}]
["Best way to contact:",null,null,null,null,null,null,null,null,null,null,null,null,"*Reimbursements are made for completed reports including original receipts with travel approval from ADCO or assigned job duties. Lodging must be documented with a folio."]
["Phone:",{"$f":"IF(Oct!B8<>\"\",Oct!B8,\"\")","v":""},null,null,"Email:",{"$f":"IF(Oct!F8<>\"\",Oct!F8,\"\")","v":""},null,null,{"$f":"IF(Jan!I8<>\"\",Jan!I8,\"\")","v":""},null,null,null,null,null,null,null,{"$f":"Jan!Q8","v":"2) Per diem for events that do not include an overnight stay are taxable. Spousal per diems are always taxable."}]
[{"$f":"Jan!A9","v":"Please log in to APS Employee online to update your address and phone number."},null,null,null,null,null,null,null,null,null,"** ADCO must approve Special Mileage."]
["Short","Daily Activity Description",null,null,null,null,null,null,"Date",null,"Special","Per Diem",null,null,"Air/Car/Gas/Transit    Other",null,null,"PD Tx","PD NTx","Per Diem","Ans: Per"]
["Description","Example: Visitation, Sermon Prep, etc.",null,null,null,null,"Budgeted Mileage",null,null,null,"Mileage**","Taxable","Non-Tax","Lodging*",null,null,null,{"$f":"$L$49","v":0},{"$f":"$M$49","v":0},"Totals","Diem"]
[]
["Worked"]
["Day Off"]
["Vacation"]
["Sick Day"]
["Holiday"]
[null,null,null,null,null,null,null,null,{"$f":"IF(N5<>'MASTER CONTROLS'!G3,N5,\"\")","v":"2022-11-01"},null,null,{"$f":"IF($U18>1,VLOOKUP($U18,'MASTER CONTROLS'!$A$3:$D$11,3,FALSE),\"\")","v":""},{"$f":"IF($U18>1,VLOOKUP($U18,'MASTER CONTROLS'!$A$3:$D$11,4,FALSE),\"\")","v":""},null,null,null,null,null,null,null,1,{"$f":"TEXT(I18,\"ddd\")","v":"Tue"}]
[null,null,null,null,null,null,null,null,{"$f":"IF(N5<>'MASTER CONTROLS'!G3,I18+1,\"\")","v":"2022-11-02"},null,null,{"$f":"IF($U19>1,VLOOKUP($U19,'MASTER CONTROLS'!$A$3:$D$11,3,FALSE),\"\")","v":""},{"$f":"IF($U19>1,VLOOKUP($U19,'MASTER CONTROLS'!$A$3:$D$11,4,FALSE),\"\")","v":""},null,null,null,null,null,null,null,1,"Wed"]
[null,null,null,null,null,null,null,null,{"$f":"IF(N5<>'MASTER CONTROLS'!G3,I19+1,\"\")","v":"2022-11-03"},null,null,{"$f":"IF($U20>1,VLOOKUP($U20,'MASTER CONTROLS'!$A$3:$D$11,3,FALSE),\"\")","v":""},{"$f":"IF($U20>1,VLOOKUP($U20,'MASTER CONTROLS'!$A$3:$D$11,4,FALSE),\"\")","v":""},null,null,null,null,null,null,null,1,"Thu"]
[null,null,null,null,null,null,null,null,{"$f":"IF(N5<>'MASTER CONTROLS'!G3,I20+1,\"\")","v":"2022-11-04"},null,null,{"$f":"IF($U21>1,VLOOKUP($U21,'MASTER CONTROLS'!$A$3:$D$11,3,FALSE),\"\")","v":""},{"$f":"IF($U21>1,VLOOKUP($U21,'MASTER CONTROLS'!$A$3:$D$11,4,FALSE),\"\")","v":""},null,null,null,null,null,null,null,1,"Fri"]
[null,null,null,null,null,null,null,null,{"$f":"IF(N5<>'MASTER CONTROLS'!G3,I21+1,\"\")","v":"2022-11-05"},null,null,{"$f":"IF($U22>1,VLOOKUP($U22,'MASTER CONTROLS'!$A$3:$D$11,3,FALSE),\"\")","v":""},{"$f":"IF($U22>1,VLOOKUP($U22,'MASTER CONTROLS'!$A$3:$D$11,4,FALSE),\"\")","v":""},null,null,null,null,null,null,null,1,"Sat"]
[null,null,null,null,null,null,null,null,{"$f":"IF(N5<>'MASTER CONTROLS'!G3,I22+1,\"\")","v":"2022-11-06"},null,null,{"$f":"IF($U23>1,VLOOKUP($U23,'MASTER CONTROLS'!$A$3:$D$11,3,FALSE),\"\")","v":""},{"$f":"IF($U23>1,VLOOKUP($U23,'MASTER CONTROLS'!$A$3:$D$11,4,FALSE),\"\")","v":""},null,null,null,null,null,null,null,1,"Sun"]
[null,null,null,null,null,null,null,null,{"$f":"IF(N5<>'MASTER CONTROLS'!G3,I23+1,\"\")","v":"2022-11-07"},null,null,{"$f":"IF($U24>1,VLOOKUP($U24,'MASTER CONTROLS'!$A$3:$D$11,3,FALSE),\"\")","v":""},{"$f":"IF($U24>1,VLOOKUP($U24,'MASTER CONTROLS'!$A$3:$D$11,4,FALSE),\"\")","v":""},null,null,null,null,null,null,null,1,"Mon"]
[null,null,null,null,null,null,null,null,{"$f":"IF(N5<>'MASTER CONTROLS'!G3,I24+1,\"\")","v":"2022-11-08"},null,null,{"$f":"IF($U25>1,VLOOKUP($U25,'MASTER CONTROLS'!$A$3:$D$11,3,FALSE),\"\")","v":""},{"$f":"IF($U25>1,VLOOKUP($U25,'MASTER CONTROLS'!$A$3:$D$11,4,FALSE),\"\")","v":""},null,null,null,null,null,null,null,1,"Tue"]
[null,null,null,null,null,null,null,null,{"$f":"IF(N5<>'MASTER CONTROLS'!G3,I25+1,\"\")","v":"2022-11-09"},null,null,{"$f":"IF($U26>1,VLOOKUP($U26,'MASTER CONTROLS'!$A$3:$D$11,3,FALSE),\"\")","v":""},{"$f":"IF($U26>1,VLOOKUP($U26,'MASTER CONTROLS'!$A$3:$D$11,4,FALSE),\"\")","v":""},null,null,null,null,null,null,null,1,"Wed"]
[null,null,null,null,null,null,null,null,{"$f":"IF(N5<>'MASTER CONTROLS'!G3,I26+1,\"\")","v":"2022-11-10"},null,null,{"$f":"IF($U27>1,VLOOKUP($U27,'MASTER CONTROLS'!$A$3:$D$11,3,FALSE),\"\")","v":""},{"$f":"IF($U27>1,VLOOKUP($U27,'MASTER CONTROLS'!$A$3:$D$11,4,FALSE),\"\")","v":""},null,null,null,null,null,null,null,1,"Thu"]
[null,null,null,null,null,null,null,null,{"$f":"IF(N5<>'MASTER CONTROLS'!G3,I27+1,\"\")","v":"2022-11-11"},null,null,{"$f":"IF($U28>1,VLOOKUP($U28,'MASTER CONTROLS'!$A$3:$D$11,3,FALSE),\"\")","v":""},{"$f":"IF($U28>1,VLOOKUP($U28,'MASTER CONTROLS'!$A$3:$D$11,4,FALSE),\"\")","v":""},null,null,null,null,null,null,null,1,"Fri"]
[null,null,null,null,null,null,null,null,{"$f":"IF(N5<>'MASTER CONTROLS'!G3,I28+1,\"\")","v":"2022-11-12"},null,null,{"$f":"IF($U29>1,VLOOKUP($U29,'MASTER CONTROLS'!$A$3:$D$11,3,FALSE),\"\")","v":""},{"$f":"IF($U29>1,VLOOKUP($U29,'MASTER CONTROLS'!$A$3:$D$11,4,FALSE),\"\")","v":""},null,null,null,null,null,null,null,1,"Sat"]
[null,null,null,null,null,null,null,null,{"$f":"IF(N5<>'MASTER CONTROLS'!G3,I29+1,\"\")","v":"2022-11-13"},null,null,{"$f":"IF($U30>1,VLOOKUP($U30,'MASTER CONTROLS'!$A$3:$D$11,3,FALSE),\"\")","v":""},{"$f":"IF($U30>1,VLOOKUP($U30,'MASTER CONTROLS'!$A$3:$D$11,4,FALSE),\"\")","v":""},null,null,null,null,null,null,null,1,"Sun"]
[null,null,null,null,null,null,null,null,{"$f":"IF(N5<>'MASTER CONTROLS'!G3,I30+1,\"\")","v":"2022-11-14"},null,null,{"$f":"IF($U31>1,VLOOKUP($U31,'MASTER CONTROLS'!$A$3:$D$11,3,FALSE),\"\")","v":""},{"$f":"IF($U31>1,VLOOKUP($U31,'MASTER CONTROLS'!$A$3:$D$11,4,FALSE),\"\")","v":""},null,null,null,null,null,null,null,1,"Mon"]
[null,null,null,null,null,null,null,null,{"$f":"IF(N5<>'MASTER CONTROLS'!G3,I31+1,\"\")","v":"2022-11-15"},null,null,{"$f":"IF($U32>1,VLOOKUP($U32,'MASTER CONTROLS'!$A$3:$D$11,3,FALSE),\"\")","v":""},{"$f":"IF($U32>1,VLOOKUP($U32,'MASTER CONTROLS'!$A$3:$D$11,4,FALSE),\"\")","v":""},null,null,null,null,null,null,null,1,"Tue"]
[null,null,null,null,null,null,null,null,{"$f":"IF(N5<>'MASTER CONTROLS'!G3,I32+1,\"\")","v":"2022-11-16"},null,null,{"$f":"IF($U33>1,VLOOKUP($U33,'MASTER CONTROLS'!$A$3:$D$11,3,FALSE),\"\")","v":""},{"$f":"IF($U33>1,VLOOKUP($U33,'MASTER CONTROLS'!$A$3:$D$11,4,FALSE),\"\")","v":""},null,null,null,null,null,null,null,1,"Wed"]
[null,null,null,null,null,null,null,null,{"$f":"IF(N5<>'MASTER CONTROLS'!G3,I33+1,\"\")","v":"2022-11-17"},null,null,{"$f":"IF($U34>1,VLOOKUP($U34,'MASTER CONTROLS'!$A$3:$D$11,3,FALSE),\"\")","v":""},{"$f":"IF($U34>1,VLOOKUP($U34,'MASTER CONTROLS'!$A$3:$D$11,4,FALSE),\"\")","v":""},null,null,null,null,null,null,null,1,"Thu"]
[null,null,null,null,null,null,null,null,{"$f":"IF(N5<>'MASTER CONTROLS'!G3,I34+1,\"\")","v":"2022-11-18"},null,null,{"$f":"IF($U35>1,VLOOKUP($U35,'MASTER CONTROLS'!$A$3:$D$11,3,FALSE),\"\")","v":""},{"$f":"IF($U35>1,VLOOKUP($U35,'MASTER CONTROLS'!$A$3:$D$11,4,FALSE),\"\")","v":""},null,null,null,null,null,null,null,1,"Fri"]
[null,null,null,null,null,null,null,null,{"$f":"IF(N5<>'MASTER CONTROLS'!G3,I35+1,\"\")","v":"2022-11-19"},null,null,{"$f":"IF($U36>1,VLOOKUP($U36,'MASTER CONTROLS'!$A$3:$D$11,3,FALSE),\"\")","v":""},{"$f":"IF($U36>1,VLOOKUP($U36,'MASTER CONTROLS'!$A$3:$D$11,4,FALSE),\"\")","v":""},null,null,null,null,null,null,null,1,"Sat"]
[null,null,null,null,null,null,null,null,{"$f":"IF(N5<>'MASTER CONTROLS'!G3,I36+1,\"\")","v":"2022-11-20"},null,null,{"$f":"IF($U37>1,VLOOKUP($U37,'MASTER CONTROLS'!$A$3:$D$11,3,FALSE),\"\")","v":""},{"$f":"IF($U37>1,VLOOKUP($U37,'MASTER CONTROLS'!$A$3:$D$11,4,FALSE),\"\")","v":""},null,null,null,null,null,null,null,1,"Sun"]
[null,null,null,null,null,null,null,null,{"$f":"IF(N5<>'MASTER CONTROLS'!G3,I37+1,\"\")","v":"2022-11-21"},null,null,{"$f":"IF($U38>1,VLOOKUP($U38,'MASTER CONTROLS'!$A$3:$D$11,3,FALSE),\"\")","v":""},{"$f":"IF($U38>1,VLOOKUP($U38,'MASTER CONTROLS'!$A$3:$D$11,4,FALSE),\"\")","v":""},null,null,null,null,null,null,null,1,"Mon"]
[null,null,null,null,null,null,null,null,{"$f":"IF(N5<>'MASTER CONTROLS'!G3,I38+1,\"\")","v":"2022-11-22"},null,null,{"$f":"IF($U39>1,VLOOKUP($U39,'MASTER CONTROLS'!$A$3:$D$11,3,FALSE),\"\")","v":""},{"$f":"IF($U39>1,VLOOKUP($U39,'MASTER CONTROLS'!$A$3:$D$11,4,FALSE),\"\")","v":""},null,null,null,null,null,null,null,1,"Tue"]
[null,null,null,null,null,null,null,null,{"$f":"IF(N5<>'MASTER CONTROLS'!G3,I39+1,\"\")","v":"2022-11-23"},null,null,{"$f":"IF($U40>1,VLOOKUP($U40,'MASTER CONTROLS'!$A$3:$D$11,3,FALSE),\"\")","v":""},{"$f":"IF($U40>1,VLOOKUP($U40,'MASTER CONTROLS'!$A$3:$D$11,4,FALSE),\"\")","v":""},null,null,null,null,null,null,null,1,"Wed"]
[null,null,null,null,null,null,null,null,{"$f":"IF(N5<>'MASTER CONTROLS'!G3,I40+1,\"\")","v":"2022-11-24"},null,null,{"$f":"IF($U41>1,VLOOKUP($U41,'MASTER CONTROLS'!$A$3:$D$11,3,FALSE),\"\")","v":""},{"$f":"IF($U41>1,VLOOKUP($U41,'MASTER CONTROLS'!$A$3:$D$11,4,FALSE),\"\")","v":""},null,null,null,null,null,null,null,1,"Thu"]
[null,null,null,null,null,null,null,null,{"$f":"IF(N5<>'MASTER CONTROLS'!G3,I41+1,\"\")","v":"2022-11-25"},null,null,{"$f":"IF($U42>1,VLOOKUP($U42,'MASTER CONTROLS'!$A$3:$D$11,3,FALSE),\"\")","v":""},{"$f":"IF($U42>1,VLOOKUP($U42,'MASTER CONTROLS'!$A$3:$D$11,4,FALSE),\"\")","v":""},null,null,null,null,null,null,null,1,"Fri"]
[null,null,null,null,null,null,null,null,{"$f":"IF(N5<>'MASTER CONTROLS'!G3,I42+1,\"\")","v":"2022-11-26"},null,null,{"$f":"IF($U43>1,VLOOKUP($U43,'MASTER CONTROLS'!$A$3:$D$11,3,FALSE),\"\")","v":""},{"$f":"IF($U43>1,VLOOKUP($U43,'MASTER CONTROLS'!$A$3:$D$11,4,FALSE),\"\")","v":""},null,null,null,null,null,null,null,1,"Sat"]
[null,null,null,null,null,null,null,null,{"$f":"IF(N5<>'MASTER CONTROLS'!G3,I43+1,\"\")","v":"2022-11-27"},null,null,{"$f":"IF($U44>1,VLOOKUP($U44,'MASTER CONTROLS'!$A$3:$D$11,3,FALSE),\"\")","v":""},{"$f":"IF($U44>1,VLOOKUP($U44,'MASTER CONTROLS'!$A$3:$D$11,4,FALSE),\"\")","v":""},null,null,null,null,null,null,null,1,"Sun"]
[null,null,null,null,null,null,null,null,{"$f":"IF(N5<>'MASTER CONTROLS'!G3,I44+1,\"\")","v":"2022-11-28"},null,null,{"$f":"IF($U45>1,VLOOKUP($U45,'MASTER CONTROLS'!$A$3:$D$11,3,FALSE),\"\")","v":""},{"$f":"IF($U45>1,VLOOKUP($U45,'MASTER CONTROLS'!$A$3:$D$11,4,FALSE),\"\")","v":""},null,null,null,null,null,null,null,1,"Mon"]
[null,null,null,null,null,null,null,null,{"$f":"IF(AND(N$5<>'MASTER CONTROLS'!$G$3,I45<VLOOKUP(N$5,'MASTER CONTROLS'!$G$3:$I$15,3)),I45+1,\"\")","v":"2022-11-29"},null,null,{"$f":"IF($U46>1,VLOOKUP($U46,'MASTER CONTROLS'!$A$3:$D$11,3,FALSE),\"\")","v":""},{"$f":"IF($U46>1,VLOOKUP($U46,'MASTER CONTROLS'!$A$3:$D$11,4,FALSE),\"\")","v":""},null,null,null,null,null,null,null,1,"Tue"]
[null,null,null,null,null,null,null,null,{"$f":"IF(AND(N$5<>'MASTER CONTROLS'!$G$3,I46<VLOOKUP(N$5,'MASTER CONTROLS'!$G$3:$I$15,3)),I46+1,\"\")","v":"2022-11-30"},null,null,{"$f":"IF($U47>1,VLOOKUP($U47,'MASTER CONTROLS'!$A$3:$D$11,3,FALSE),\"\")","v":""},{"$f":"IF($U47>1,VLOOKUP($U47,'MASTER CONTROLS'!$A$3:$D$11,4,FALSE),\"\")","v":""},null,null,null,null,null,null,null,1,"Wed"]
[null,null,null,null,null,null,null,null,{"$f":"IF(AND(N$5<>'MASTER CONTROLS'!$G$3,I47<VLOOKUP(N$5,'MASTER CONTROLS'!$G$3:$I$15,3)),I47+1,\"\")","v":""},null,null,{"$f":"IF($U48>1,VLOOKUP($U48,'MASTER CONTROLS'!$A$3:$D$11,3,FALSE),\"\")","v":""},{"$f":"IF($U48>1,VLOOKUP($U48,'MASTER CONTROLS'!$A$3:$D$11,4,FALSE),\"\")","v":""},null,null,null,null,null,null,null,1,""]
["TOTALS",null,null,null,null,null,{"$f":"SUM(G18:H48)","v":0},null,null,null,{"$f":"SUM(K18:K48)","v":0},0,0,0,0,0]
[]
["Office Staff Section",null,null,null,null,null,null,null,null,null,null,null,null,"Phone","Internet","Total"]
[null,null,null,null,null,null,null,null,null,null,null,null,null,null,null,{"$f":"SUM(N52:O52)","v":0}]
[]
["Pastor's Section",null,null,null,null,null,null,null,{"$f":"Jan!I54","v":"Profession of Faith"},null,null,"Worship Service Attendance"]
[{"$f":"Jan!A55","v":"Church Name "},null,null,null,null,null,null,"Baptisms",null,null,"Transfers","Week 1","Week 2","Week 3","Week 4","Week 5"]
[null,null,null,null,null,null,null,null,null,null,null,null,null,null,null,null,{"$f":"COUNTIF(V18:V48,\"Sat\")","v":4},{"$f":"COUNT(G56:P56)","v":0}]
[]
[]
[]
[]
["Comments & Notes"]
[]
[null,null,null,null,null,null,null,null,null,null,null,null,null,null,null,null,null,null,null,null,false]
[]
["OFFICE USE ONLY"]
["10200) Travel Budget",null,null,null,null,null,"10201) Per Diem Tx",null,null,null,null,null,"11206) Travel Misc"]
["11211) Non-Tax Miles",null,null,null,null,null,"11201) Per Diem NTx",null,null,null,null,null,"11230) Conv./Mtgs"]
["11200) Special Miles",null,null,null,null,null,"11202) Lodging",null,null,null,null,null,"11403) Phone"]
["10212) Spouse Travel",null,null,null,null,null,"11203) Car Rental",null,null,null,null,null,"10408) Internet"]
["11405) Entertainment",null,null,null,null,null,"11209) Airfare Travel"]

{"sheet":"Dec","index":12,"n_rows":70,"n_cols":22,"rows_kept":70,"cut":false,"hidden":false,"merged":[[68,12,68,13],[66,0,66,2],[69,12,69,13],[68,14,68,15],[65,14,65,15],[66,14,66,15],[67,14,67,15],[65,12,65,13],[65,0,65,2],[65,6,65,8],[26,6,26,7],[25,6,25,7],[24,6,24,7],[23,6,23,7],[22,6,22,7],[21,6,21,7],[32,1,32,5],[38,1,38,5],[64,0,64,15],[33,6,33,7],[32,6,32,7],[31,6,31,7],[30,6,30,7],[29,6,29,7],[28,6,28,7],[27,6,27,7],[67,0,67,2],[69,0,69,1],[69,6,69,7],[66,3,66,4],[67,3,67,4],[18,1,18,5],[5,1,5,9],[53,11,53,15],[67,6,67,8],[66,6,66,8],[67,12,67,13],[60,0,61,1],[0,0,0,15],[37,1,37,5],[9,1,9,5],[10,1,10,5],[17,1,17,5],[9,14,10,15],[36,1,36,5],[35,1,35,5],[1,0,1,15],[4,13,4,15],[5,13,5,15],[6,13,8,15],[8,0,8,9],[8,10,8,12],[3,1,3,9],[7,5,7,10],[4,1,4,9],[68,3,68,4],[68,0,68,2],[68,6,68,8],[66,12,66,13],[65,3,65,4],[41,1,41,5],[46,1,46,5],[47,1,47,5],[42,1,42,5],[59,0,59,2],[60,2,61,15],[59,11,59,12],[59,13,59,14],[59,9,59,10],[55,8,55,9],[55,0,55,6],[56,0,56,6],[56,8,56,9],[57,8,57,9],[59,6,59,8],[57,0,57,6],[53,0,53,1],[45,8,45,9],[48,6,48,7],[47,6,47,7],[46,6,46,7],[45,6,45,7],[18,8,18,9],[41,8,41,9],[44,8,44,9],[19,8,19,9],[42,8,42,9],[29,8,29,9],[21,8,21,9],[40,8,40,9],[37,8,37,9],[30,8,30,9],[39,8,39,9],[36,8,36,9],[38,8,38,9],[35,8,35,9],[32,8,32,9],[34,8,34,9],[20,6,20,7],[19,6,19,7],[18,6,18,7],[35,6,35,7],[34,6,34,7],[19,1,19,5],[20,1,20,5],[21,1,21,5],[25,8,25,9],[22,8,22,9],[34,1,34,5],[27,8,27,9],[23,8,23,9],[24,1,24,5],[26,1,26,5],[26,8,26,9],[28,8,28,9],[33,1,33,5],[30,1,30,5],[28,1,28,5],[22,1,22,5],[27,1,27,5],[29,1,29,5],[24,8,24,9],[25,1,25,5],[20,8,20,9],[23,1,23,5],[31,1,31,5],[31,8,31,9],[39,1,39,5],[40,1,40,5],[44,1,44,5],[43,1,43,5],[53,8,54,9],[46,8,46,9],[33,8,33,9],[45,1,45,5],[48,0,48,5],[54,0,54,5],[51,0,51,12],[50,0,50,2],[43,8,43,9],[47,8,47,9],[48,8,48,9],[44,6,44,7],[43,6,43,7],[42,6,42,7],[41,6,41,7],[40,6,40,7],[39,6,39,7],[38,6,38,7],[37,6,37,7],[36,6,36,7],[3,16,3,19],[4,16,6,19],[7,16,7,19],[6,0,6,9],[7,1,7,3],[9,11,9,12],[9,8,10,9],[9,6,9,7],[17,8,17,9],[17,6,17,7],[10,6,10,7]]}
[{"$f":"\"Northern California Conference Expense Report\" & IF($U$63=TRUE,\" (REVISED)\",\"\")","v":"Northern California Conference Expense Report"}]
[{"$f":"Jan!A2","v":"Email to: payroll@nccsda.com      "},null,null,null,null,null,null,null,null,null,null,null,null,null,null,null,null,null,null,null,false]
[]
["Name",{"$f":"IF(Jan!B4<>\"\",Jan!B4,\"\")","v":""},null,null,null,null,null,null,null,null,null,null,null,null,null,null,"Per Diem Note:"]
["Address",{"$f":"IF(Nov!B5<>\"\",Nov!B5,\"\")","v":""},null,null,{"$f":"IF(Jan!E5<>\"\",Jan!E5,\"\")","v":""},null,null,{"$f":"IF(Jan!H5<>\"\",Jan!H5,\"\")","v":""},null,null,null,null,null,{"$f":"'MASTER CONTROLS'!G15","v":"2022-12-01"},null,null,"1) If you are away from home and have an overnight stay on either side of a day you qualify for per diem, choose an option with NT."]
[null,{"$f":"IF(Nov!B6<>\"\",Nov!B6,\"\")","v":""},null,null,{"$f":"IF(Jan!E6<>\"\",Jan!E6,\"\")","v":""},null,null,{"$f":"IF(Jan!H6<>\"\",Jan!H6,\"\")","v":""},null,null,null,null,null,{"$f":" IF(N5<>'MASTER CONTROLS'!G3,\"Due \" & TEXT(DATE(1,MONTH(I18)+1,1),\"mmmm\") & \" 3rd.\",\"\")","v":"Due January 3rd."}]
["Best way to contact:",null,null,null,null,null,null,null,null,null,null,null,null,"*Reimbursements are made for completed reports including original receipts with travel approval from ADCO or assigned job duties. Lodging must be documented with a folio."]
["Phone:",{"$f":"IF(Nov!B8<>\"\",Nov!B8,\"\")","v":""},null,null,"Email:",{"$f":"IF(Nov!F8<>\"\",Nov!F8,\"\")","v":""},null,null,{"$f":"IF(Jan!I8<>\"\",Jan!I8,\"\")","v":""},null,null,null,null,null,null,null,{"$f":"Jan!Q8","v":"2) Per diem for events that do not include an overnight stay are taxable. Spousal per diems are always taxable."}]
[{"$f":"Jan!A9","v":"Please log in to APS Employee online to update your address and phone number."},null,null,null,null,null,null,null,null,null,"** ADCO must approve Special Mileage."]
["Short","Daily Activity Description",null,null,null,null,null,null,"Date",null,"Special","Per Diem",null,null,"Air/Car/Gas/Transit    Other",null,null,"PD Tx","PD NTx","Per Diem","Ans: Per"]
["Description","Example: Visitation, Sermon Prep, etc.",null,null,null,null,"Budgeted Mileage",null,null,null,"Mileage**","Taxable","Non-Tax","Lodging*",null,null,null,{"$f":"$L$49","v":0},{"$f":"$M$49","v":0},"Totals","Diem"]
[]
["Worked"]
["Day Off"]
["Vacation"]
["Sick Day"]
["Holiday"]
[null,null,null,null,null,null,null,null,{"$f":"IF(N5<>'MASTER CONTROLS'!G3,N5,\"\")","v":"2022-12-01"},null,null,{"$f":"IF($U18>1,VLOOKUP($U18,'MASTER CONTROLS'!$A$3:$D$11,3,FALSE),\"\")","v":""},{"$f":"IF($U18>1,VLOOKUP($U18,'MASTER CONTROLS'!$A$3:$D$11,4,FALSE),\"\")","v":""},null,null,null,null,null,null,null,1,{"$f":"TEXT(I18,\"ddd\")","v":"Thu"}]
[null,null,null,null,null,null,null,null,{"$f":"IF(N5<>'MASTER CONTROLS'!G3,I18+1,\"\")","v":"2022-12-02"},null,null,{"$f":"IF($U19>1,VLOOKUP($U19,'MASTER CONTROLS'!$A$3:$D$11,3,FALSE),\"\")","v":""},{"$f":"IF($U19>1,VLOOKUP($U19,'MASTER CONTROLS'!$A$3:$D$11,4,FALSE),\"\")","v":""},null,null,null,null,null,null,null,1,{"$f":"TEXT(I19,\"ddd\")","v":"Fri"}]
[null,null,null,null,null,null,null,null,{"$f":"IF(N5<>'MASTER CONTROLS'!G3,I19+1,\"\")","v":"2022-12-03"},null,null,{"$f":"IF($U20>1,VLOOKUP($U20,'MASTER CONTROLS'!$A$3:$D$11,3,FALSE),\"\")","v":""},{"$f":"IF($U20>1,VLOOKUP($U20,'MASTER CONTROLS'!$A$3:$D$11,4,FALSE),\"\")","v":""},null,null,null,null,null,null,null,1,"Sat"]
[null,null,null,null,null,null,null,null,{"$f":"IF(N5<>'MASTER CONTROLS'!G3,I20+1,\"\")","v":"2022-12-04"},null,null,{"$f":"IF($U21>1,VLOOKUP($U21,'MASTER CONTROLS'!$A$3:$D$11,3,FALSE),\"\")","v":""},{"$f":"IF($U21>1,VLOOKUP($U21,'MASTER CONTROLS'!$A$3:$D$11,4,FALSE),\"\")","v":""},null,null,null,null,null,null,null,1,"Sun"]
[null,null,null,null,null,null,null,null,{"$f":"IF(N5<>'MASTER CONTROLS'!G3,I21+1,\"\")","v":"2022-12-05"},null,null,{"$f":"IF($U22>1,VLOOKUP($U22,'MASTER CONTROLS'!$A$3:$D$11,3,FALSE),\"\")","v":""},{"$f":"IF($U22>1,VLOOKUP($U22,'MASTER CONTROLS'!$A$3:$D$11,4,FALSE),\"\")","v":""},null,null,null,null,null,null,null,1,"Mon"]
[null,null,null,null,null,null,null,null,{"$f":"IF(N5<>'MASTER CONTROLS'!G3,I22+1,\"\")","v":"2022-12-06"},null,null,{"$f":"IF($U23>1,VLOOKUP($U23,'MASTER CONTROLS'!$A$3:$D$11,3,FALSE),\"\")","v":""},{"$f":"IF($U23>1,VLOOKUP($U23,'MASTER CONTROLS'!$A$3:$D$11,4,FALSE),\"\")","v":""},null,null,null,null,null,null,null,1,"Tue"]
[null,null,null,null,null,null,null,null,{"$f":"IF(N5<>'MASTER CONTROLS'!G3,I23+1,\"\")","v":"2022-12-07"},null,null,{"$f":"IF($U24>1,VLOOKUP($U24,'MASTER CONTROLS'!$A$3:$D$11,3,FALSE),\"\")","v":""},{"$f":"IF($U24>1,VLOOKUP($U24,'MASTER CONTROLS'!$A$3:$D$11,4,FALSE),\"\")","v":""},null,null,null,null,null,null,null,1,"Wed"]
[null,null,null,null,null,null,null,null,{"$f":"IF(N5<>'MASTER CONTROLS'!G3,I24+1,\"\")","v":"2022-12-08"},null,null,{"$f":"IF($U25>1,VLOOKUP($U25,'MASTER CONTROLS'!$A$3:$D$11,3,FALSE),\"\")","v":""},{"$f":"IF($U25>1,VLOOKUP($U25,'MASTER CONTROLS'!$A$3:$D$11,4,FALSE),\"\")","v":""},null,null,null,null,null,null,null,1,"Thu"]
[null,null,null,null,null,null,null,null,{"$f":"IF(N5<>'MASTER CONTROLS'!G3,I25+1,\"\")","v":"2022-12-09"},null,null,{"$f":"IF($U26>1,VLOOKUP($U26,'MASTER CONTROLS'!$A$3:$D$11,3,FALSE),\"\")","v":""},{"$f":"IF($U26>1,VLOOKUP($U26,'MASTER CONTROLS'!$A$3:$D$11,4,FALSE),\"\")","v":""},null,null,null,null,null,null,null,1,"Fri"]
[null,null,null,null,null,null,null,null,{"$f":"IF(N5<>'MASTER CONTROLS'!G3,I26+1,\"\")","v":"2022-12-10"},null,null,{"$f":"IF($U27>1,VLOOKUP($U27,'MASTER CONTROLS'!$A$3:$D$11,3,FALSE),\"\")","v":""},{"$f":"IF($U27>1,VLOOKUP($U27,'MASTER CONTROLS'!$A$3:$D$11,4,FALSE),\"\")","v":""},null,null,null,null,null,null,null,1,"Sat"]
[null,null,null,null,null,null,null,null,{"$f":"IF(N5<>'MASTER CONTROLS'!G3,I27+1,\"\")","v":"2022-12-11"},null,null,{"$f":"IF($U28>1,VLOOKUP($U28,'MASTER CONTROLS'!$A$3:$D$11,3,FALSE),\"\")","v":""},{"$f":"IF($U28>1,VLOOKUP($U28,'MASTER CONTROLS'!$A$3:$D$11,4,FALSE),\"\")","v":""},null,null,null,null,null,null,null,1,"Sun"]
[null,null,null,null,null,null,null,null,{"$f":"IF(N5<>'MASTER CONTROLS'!G3,I28+1,\"\")","v":"2022-12-12"},null,null,{"$f":"IF($U29>1,VLOOKUP($U29,'MASTER CONTROLS'!$A$3:$D$11,3,FALSE),\"\")","v":""},{"$f":"IF($U29>1,VLOOKUP($U29,'MASTER CONTROLS'!$A$3:$D$11,4,FALSE),\"\")","v":""},null,null,null,null,null,null,null,1,"Mon"]
[null,null,null,null,null,null,null,null,{"$f":"IF(N5<>'MASTER CONTROLS'!G3,I29+1,\"\")","v":"2022-12-13"},null,null,{"$f":"IF($U30>1,VLOOKUP($U30,'MASTER CONTROLS'!$A$3:$D$11,3,FALSE),\"\")","v":""},{"$f":"IF($U30>1,VLOOKUP($U30,'MASTER CONTROLS'!$A$3:$D$11,4,FALSE),\"\")","v":""},null,null,null,null,null,null,null,1,"Tue"]
[null,null,null,null,null,null,null,null,{"$f":"IF(N5<>'MASTER CONTROLS'!G3,I30+1,\"\")","v":"2022-12-14"},null,null,{"$f":"IF($U31>1,VLOOKUP($U31,'MASTER CONTROLS'!$A$3:$D$11,3,FALSE),\"\")","v":""},{"$f":"IF($U31>1,VLOOKUP($U31,'MASTER CONTROLS'!$A$3:$D$11,4,FALSE),\"\")","v":""},null,null,null,null,null,null,null,1,"Wed"]
[null,null,null,null,null,null,null,null,{"$f":"IF(N5<>'MASTER CONTROLS'!G3,I31+1,\"\")","v":"2022-12-15"},null,null,{"$f":"IF($U32>1,VLOOKUP($U32,'MASTER CONTROLS'!$A$3:$D$11,3,FALSE),\"\")","v":""},{"$f":"IF($U32>1,VLOOKUP($U32,'MASTER CONTROLS'!$A$3:$D$11,4,FALSE),\"\")","v":""},null,null,null,null,null,null,null,1,"Thu"]
[null,null,null,null,null,null,null,null,{"$f":"IF(N5<>'MASTER CONTROLS'!G3,I32+1,\"\")","v":"2022-12-16"},null,null,{"$f":"IF($U33>1,VLOOKUP($U33,'MASTER CONTROLS'!$A$3:$D$11,3,FALSE),\"\")","v":""},{"$f":"IF($U33>1,VLOOKUP($U33,'MASTER CONTROLS'!$A$3:$D$11,4,FALSE),\"\")","v":""},null,null,null,null,null,null,null,1,"Fri"]
[null,null,null,null,null,null,null,null,{"$f":"IF(N5<>'MASTER CONTROLS'!G3,I33+1,\"\")","v":"2022-12-17"},null,null,{"$f":"IF($U34>1,VLOOKUP($U34,'MASTER CONTROLS'!$A$3:$D$11,3,FALSE),\"\")","v":""},{"$f":"IF($U34>1,VLOOKUP($U34,'MASTER CONTROLS'!$A$3:$D$11,4,FALSE),\"\")","v":""},null,null,null,null,null,null,null,1,"Sat"]
[null,null,null,null,null,null,null,null,{"$f":"IF(N5<>'MASTER CONTROLS'!G3,I34+1,\"\")","v":"2022-12-18"},null,null,{"$f":"IF($U35>1,VLOOKUP($U35,'MASTER CONTROLS'!$A$3:$D$11,3,FALSE),\"\")","v":""},{"$f":"IF($U35>1,VLOOKUP($U35,'MASTER CONTROLS'!$A$3:$D$11,4,FALSE),\"\")","v":""},null,null,null,null,null,null,null,1,"Sun"]
[null,null,null,null,null,null,null,null,{"$f":"IF(N5<>'MASTER CONTROLS'!G3,I35+1,\"\")","v":"2022-12-19"},null,null,{"$f":"IF($U36>1,VLOOKUP($U36,'MASTER CONTROLS'!$A$3:$D$11,3,FALSE),\"\")","v":""},{"$f":"IF($U36>1,VLOOKUP($U36,'MASTER CONTROLS'!$A$3:$D$11,4,FALSE),\"\")","v":""},null,null,null,null,null,null,null,1,"Mon"]
[null,null,null,null,null,null,null,null,{"$f":"IF(N5<>'MASTER CONTROLS'!G3,I36+1,\"\")","v":"2022-12-20"},null,null,{"$f":"IF($U37>1,VLOOKUP($U37,'MASTER CONTROLS'!$A$3:$D$11,3,FALSE),\"\")","v":""},{"$f":"IF($U37>1,VLOOKUP($U37,'MASTER CONTROLS'!$A$3:$D$11,4,FALSE),\"\")","v":""},null,null,null,null,null,null,null,1,"Tue"]
[null,null,null,null,null,null,null,null,{"$f":"IF(N5<>'MASTER CONTROLS'!G3,I37+1,\"\")","v":"2022-12-21"},null,null,{"$f":"IF($U38>1,VLOOKUP($U38,'MASTER CONTROLS'!$A$3:$D$11,3,FALSE),\"\")","v":""},{"$f":"IF($U38>1,VLOOKUP($U38,'MASTER CONTROLS'!$A$3:$D$11,4,FALSE),\"\")","v":""},null,null,null,null,null,null,null,1,"Wed"]
[null,null,null,null,null,null,null,null,{"$f":"IF(N5<>'MASTER CONTROLS'!G3,I38+1,\"\")","v":"2022-12-22"},null,null,{"$f":"IF($U39>1,VLOOKUP($U39,'MASTER CONTROLS'!$A$3:$D$11,3,FALSE),\"\")","v":""},{"$f":"IF($U39>1,VLOOKUP($U39,'MASTER CONTROLS'!$A$3:$D$11,4,FALSE),\"\")","v":""},null,null,null,null,null,null,null,1,"Thu"]
[null,null,null,null,null,null,null,null,{"$f":"IF(N5<>'MASTER CONTROLS'!G3,I39+1,\"\")","v":"2022-12-23"},null,null,{"$f":"IF($U40>1,VLOOKUP($U40,'MASTER CONTROLS'!$A$3:$D$11,3,FALSE),\"\")","v":""},{"$f":"IF($U40>1,VLOOKUP($U40,'MASTER CONTROLS'!$A$3:$D$11,4,FALSE),\"\")","v":""},null,null,null,null,null,null,null,1,"Fri"]
[null,null,null,null,null,null,null,null,{"$f":"IF(N5<>'MASTER CONTROLS'!G3,I40+1,\"\")","v":"2022-12-24"},null,null,{"$f":"IF($U41>1,VLOOKUP($U41,'MASTER CONTROLS'!$A$3:$D$11,3,FALSE),\"\")","v":""},{"$f":"IF($U41>1,VLOOKUP($U41,'MASTER CONTROLS'!$A$3:$D$11,4,FALSE),\"\")","v":""},null,null,null,null,null,null,null,1,"Sat"]
[null,null,null,null,null,null,null,null,{"$f":"IF(N5<>'MASTER CONTROLS'!G3,I41+1,\"\")","v":"2022-12-25"},null,null,{"$f":"IF($U42>1,VLOOKUP($U42,'MASTER CONTROLS'!$A$3:$D$11,3,FALSE),\"\")","v":""},{"$f":"IF($U42>1,VLOOKUP($U42,'MASTER CONTROLS'!$A$3:$D$11,4,FALSE),\"\")","v":""},null,null,null,null,null,null,null,1,"Sun"]
[null,null,null,null,null,null,null,null,{"$f":"IF(N5<>'MASTER CONTROLS'!G3,I42+1,\"\")","v":"2022-12-26"},null,null,{"$f":"IF($U43>1,VLOOKUP($U43,'MASTER CONTROLS'!$A$3:$D$11,3,FALSE),\"\")","v":""},{"$f":"IF($U43>1,VLOOKUP($U43,'MASTER CONTROLS'!$A$3:$D$11,4,FALSE),\"\")","v":""},null,null,null,null,null,null,null,1,"Mon"]
[null,null,null,null,null,null,null,null,{"$f":"IF(N5<>'MASTER CONTROLS'!G3,I43+1,\"\")","v":"2022-12-27"},null,null,{"$f":"IF($U44>1,VLOOKUP($U44,'MASTER CONTROLS'!$A$3:$D$11,3,FALSE),\"\")","v":""},{"$f":"IF($U44>1,VLOOKUP($U44,'MASTER CONTROLS'!$A$3:$D$11,4,FALSE),\"\")","v":""},null,null,null,null,null,null,null,1,"Tue"]
[null,null,null,null,null,null,null,null,{"$f":"IF(N5<>'MASTER CONTROLS'!G3,I44+1,\"\")","v":"2022-12-28"},null,null,{"$f":"IF($U45>1,VLOOKUP($U45,'MASTER CONTROLS'!$A$3:$D$11,3,FALSE),\"\")","v":""},{"$f":"IF($U45>1,VLOOKUP($U45,'MASTER CONTROLS'!$A$3:$D$11,4,FALSE),\"\")","v":""},null,null,null,null,null,null,null,1,"Wed"]
[null,null,null,null,null,null,null,null,{"$f":"IF(AND(N$5<>'MASTER CONTROLS'!$G$3,I45<VLOOKUP(N$5,'MASTER CONTROLS'!$G$3:$I$15,3)),I45+1,\"\")","v":"2022-12-29"},null,null,{"$f":"IF($U46>1,VLOOKUP($U46,'MASTER CONTROLS'!$A$3:$D$11,3,FALSE),\"\")","v":""},{"$f":"IF($U46>1,VLOOKUP($U46,'MASTER CONTROLS'!$A$3:$D$11,4,FALSE),\"\")","v":""},null,null,null,null,null,null,null,1,"Thu"]
[null,null,null,null,null,null,null,null,{"$f":"IF(AND(N$5<>'MASTER CONTROLS'!$G$3,I46<VLOOKUP(N$5,'MASTER CONTROLS'!$G$3:$I$15,3)),I46+1,\"\")","v":"2022-12-30"},null,null,{"$f":"IF($U47>1,VLOOKUP($U47,'MASTER CONTROLS'!$A$3:$D$11,3,FALSE),\"\")","v":""},{"$f":"IF($U47>1,VLOOKUP($U47,'MASTER CONTROLS'!$A$3:$D$11,4,FALSE),\"\")","v":""},null,null,null,null,null,null,null,1,"Fri"]
[null,null,null,null,null,null,null,null,{"$f":"IF(AND(N$5<>'MASTER CONTROLS'!$G$3,I47<VLOOKUP(N$5,'MASTER CONTROLS'!$G$3:$I$15,3)),I47+1,\"\")","v":"2022-12-31"},null,null,{"$f":"IF($U48>1,VLOOKUP($U48,'MASTER CONTROLS'!$A$3:$D$11,3,FALSE),\"\")","v":""},{"$f":"IF($U48>1,VLOOKUP($U48,'MASTER CONTROLS'!$A$3:$D$11,4,FALSE),\"\")","v":""},null,null,null,null,null,null,null,1,"Sat"]
["TOTALS",null,null,null,null,null,{"$f":"SUM(G18:H48)","v":0},null,null,null,{"$f":"SUM(K18:K48)","v":0},{"$f":"SUM(L18:L48)","v":0},{"$f":"SUM(M18:M48)","v":0},0,0,0]
[]
["Office Staff Section",null,null,null,null,null,null,null,null,null,null,null,null,"Phone","Internet","Total"]
[null,null,null,null,null,null,null,null,null,null,null,null,null,null,null,{"$f":"SUM(N52:O52)","v":0}]
[]
["Pastor's Section",null,null,null,null,null,null,null,{"$f":"Jan!I54","v":"Profession of Faith"},null,null,"Worship Service Attendance"]
[{"$f":"Jan!A55","v":"Church Name "},null,null,null,null,null,null,"Baptisms",null,null,"Transfers","Week 1","Week 2","Week 3","Week 4","Week 5"]
[null,null,null,null,null,null,null,null,null,null,null,null,null,null,null,null,{"$f":"COUNTIF(V18:V48,\"Sat\")","v":5},{"$f":"COUNT(G56:P56)","v":0}]
[]
[]
[]
[]
["Comments & Notes"]
[]
[null,null,null,null,null,null,null,null,null,null,null,null,null,null,null,null,null,null,null,null,false]
[]
["OFFICE USE ONLY"]
["10200) Travel Budget",null,null,null,null,null,"10201) Per Diem Tx",null,null,null,null,null,"11206) Travel Misc"]
["11211) Non-Tax Miles",null,null,null,null,null,"11201) Per Diem NTx",null,null,null,null,null,"11230) Conv./Mtgs"]
["11200) Special Miles",null,null,null,null,null,"11202) Lodging",null,null,null,null,null,"11403) Phone"]
["10212) Spouse Travel",null,null,null,null,null,"11203) Car Rental",null,null,null,null,null,"10408) Internet"]
["11405) Entertainment",null,null,null,null,null,"11209) Airfare Travel"]

{"sheet":"Policy","index":13,"n_rows":0,"n_cols":0,"rows_kept":0,"cut":false,"hidden":false,"merged":[]}

{"sheet":"MASTER CONTROLS","index":14,"n_rows":16,"n_cols":10,"rows_kept":16,"cut":false,"hidden":true,"merged":[[0,0,0,3],[0,5,0,8],[13,0,22,3]]}
["Per Diem Rates",null,null,null,null,"Date Controls"]
[null,null,null,null,null,null,null,null,{"$f":"IF(G2>1,VLOOKUP(G2,F3:I15,2),\"\")","v":""},{"$f":"IF(G2>1,VLOOKUP(G2,F3:I15,4),\"\")","v":""}]
[1,"Choose From…","TX","Non-TX",null,1,"Select Month"]
[2,"NT - 1 Meal",null,25,null,2,"2022-01-01",null,{"$f":"G5-1","v":"2022-01-31"}]
[3,"NT - 2/3 Meals",null,{"$f":"D4*2","v":50},null,3,{"$f":"DATE(YEAR(G4),MONTH(G4)+1,1)","v":"2022-02-01"},null,{"$f":"G6-1","v":"2022-02-28"}]
[4,"1 Meal ",{"$f":"ROUND(D4,0)","v":25},null,null,4,"2022-03-01",null,"2022-03-31"]
[5,"2/3 Meals",{"$f":"D5","v":50},null,null,5,"2022-04-01",null,"2022-04-30"]
[6,"U & Spouse 1 Meal",{"$f":"C9*0.5","v":37.5},null,null,6,"2022-05-01",null,"2022-05-31"]
[7,"U & Spouse 2/3 Meals",75,null,null,7,"2022-06-01",null,"2022-06-30"]
[8,"NT - U & Spouse 1 Meal",{"$f":"ROUND(C8-D10,0)","v":13},{"$f":"ROUND(D4,0)","v":25},null,8,"2022-07-01",null,"2022-07-31"]
[9,"NT - U & Spouse 2/3 Meals",{"$f":"C9-D11","v":25},{"$f":"D5","v":50},null,9,"2022-08-01",null,"2022-08-31"]
[null,null,null,null,null,10,"2022-09-01",null,"2022-09-30"]
[null,null,null,null,null,11,"2022-10-01",null,"2022-10-31"]
["INSTRUCTIONS:  Enter the correct value in the blue cell and the rest of that section will automatically adjust based on the value you have entered. The Date Controls value should be set to the first day of the year (ie \"1/1/2008\" for the year 2008).",null,null,null,null,12,"2022-11-01",null,"2022-11-30"]
[null,null,null,null,null,13,"2022-12-01",null,"2022-12-31"]
[null,null,null,null,null,null,"2023-01-01"]